BDBM61240 2-[4-(4-chlorophenyl)-3-cyano-6-thiophen-2-yl-pyridin-2-yl]sulfanylethanoic acid::2-[4-(4-chlorophenyl)-3-cyano-6-thiophen-2-ylpyridin-2-yl]sulfanylacetic acid::2-[[4-(4-chlorophenyl)-3-cyano-6-(2-thienyl)-2-pyridyl]thio]acetic acid::2-[[4-(4-chlorophenyl)-3-cyano-6-thiophen-2-yl-2-pyridinyl]thio]acetic acid::MLS001213465::SMR000540552::cid_2003392
SMILES OC(=O)CSc1nc(cc(-c2ccc(Cl)cc2)c1C#N)-c1cccs1
InChI Key InChIKey=UQCLCESEXBRIHE-UHFFFAOYSA-N
Data  6 IC50
  Tab Delimited (TSV)   2D SDfile   Computed 3D by Vconf -m prep SDfile
Find this compound or compounds like it in BindingDB:
Activity Spreadsheet -- Enzyme Inhibition Constant Data from BindingDB
Found 6 hits for monomerid = 61240
TargetSUMO-conjugating enzyme UBC9(Homo sapiens (Human))
Burnham Center For Chemical Genomics
Curated by PubChem BioAssay
LigandPNGBDBM61240(2-[4-(4-chlorophenyl)-3-cyano-6-thiophen-2-yl-pyri...)
Affinity DataIC50:  8.73E+3nM. Assay description: Data Source: Sanford-Burnham Center for Chemical Genomics (SBCCG) Source Affiliation: Sanford-Burnham Medical Research Institute (SBMRI, San Diego, C...
In DepthDetails PCBioAssay
TargetPolyadenylate-binding protein 1(Homo sapiens (Human))
Burnham Center For Chemical Genomics
Curated by PubChem BioAssay
LigandPNGBDBM61240(2-[4-(4-chlorophenyl)-3-cyano-6-thiophen-2-yl-pyri...)
Affinity DataIC50:  3.97E+4nM. Assay description: Data Source: Sanford-Burnham Center for Chemical Genomics (SBCCG) Source Affiliation: Sanford-Burnham Medical Research Institute (SBMRI, San Diego, C...
In DepthDetails PCBioAssay
TargetTrans-activator protein BZLF1(Human herpesvirus 4)
The Scripps Research Institute Molecular Screening Center
Curated by PubChem BioAssay
LigandPNGBDBM61240(2-[4-(4-chlorophenyl)-3-cyano-6-thiophen-2-yl-pyri...)
Affinity DataIC50: >6.70E+4nM. Assay description: Source (MLPCN Center Name): The Scripps Research Institute Molecular Screening Center (SRIMSC) Center Affiliation: The Scripps Research Institute (TS...
In DepthDetails PCBioAssay
TargetEukaryotic translation initiation factor 4H(Homo sapiens (Human))
Burnham Center For Chemical Genomics
Curated by PubChem BioAssay
LigandPNGBDBM61240(2-[4-(4-chlorophenyl)-3-cyano-6-thiophen-2-yl-pyri...)
Affinity DataIC50:  1.07E+4nM. Assay description: Data Source: Sanford-Burnham Center for Chemical Genomics (SBCCG) Source Affiliation: Sanford-Burnham Medical Research Institute (SBMRI, San Diego, C...
In DepthDetails PCBioAssay
TargetMu-type opioid receptor(Homo sapiens (Human))
The Scripps Research Institute Molecular Screening Center
Curated by PubChem BioAssay
LigandPNGBDBM61240(2-[4-(4-chlorophenyl)-3-cyano-6-thiophen-2-yl-pyri...)
Affinity DataIC50:  6.66E+3nM. Assay description: Source (MLPCN Center Name): The Scripps Research Institute Molecular Screening Center (SRIMSC) Center Affiliation: The Scripps Research Institute (TS...
In DepthDetails PCBioAssay
TargetSUMO-activating enzyme subunit 1(Homo sapiens (Human))
Burnham Center For Chemical Genomics
Curated by PubChem BioAssay
LigandPNGBDBM61240(2-[4-(4-chlorophenyl)-3-cyano-6-thiophen-2-yl-pyri...)
Affinity DataIC50:  1.00E+5nM. Assay description: Data Source: Sanford-Burnham Center for Chemical Genomics (SBCCG) Source Affiliation: Sanford-Burnham Medical Research Institute (SBMRI, San Diego, C...
In DepthDetails PCBioAssay