BDBM61261 3-(1,3-diketo-4,6-dimethyl-3a,4,7,7a-tetrahydroisoindol-2-yl)propyl-trimethyl-ammonium;iodide::3-(4,6-dimethyl-1,3-dioxo-3a,4,7,7a-tetrahydroisoindol-2-yl)propyl-trimethylammonium;iodide::3-(4,6-dimethyl-1,3-dioxo-3a,4,7,7a-tetrahydroisoindol-2-yl)propyl-trimethylazanium;iodide::3-[4,6-dimethyl-1,3-bis(oxidanylidene)-3a,4,7,7a-tetrahydroisoindol-2-yl]propyl-trimethyl-azanium;iodide::MLS000030667::SMR000009386::[3-(4,6-Dimethyl-1,3-dioxo-1,3,3a,4,7,7a-hexahydro-isoindol-2-yl)-propyl]-trimethyl-ammonium::cid_646692
SMILES CC1C=C(C)CC2C1C(=O)N(CCC[N+](C)(C)C)C2=O
InChI Key InChIKey=GOEBHGSAJXXUNJ-UHFFFAOYSA-N
Data  2 IC50
  Tab Delimited (TSV)   2D SDfile   Computed 3D by Vconf -m prep SDfile
Find this compound or compounds like it in BindingDB:
Activity Spreadsheet -- Enzyme Inhibition Constant Data from BindingDB
Found 2 hits for monomerid = 61261
TargetEukaryotic translation initiation factor 4H(Homo sapiens (Human))
Burnham Center For Chemical Genomics
Curated by PubChem BioAssay
LigandPNGBDBM61261(3-(1,3-diketo-4,6-dimethyl-3a,4,7,7a-tetrahydroiso...)
Affinity DataIC50:  9.78E+4nM. Assay description: Data Source: Sanford-Burnham Center for Chemical Genomics (SBCCG) Source Affiliation: Sanford-Burnham Medical Research Institute (SBMRI, San Diego, C...
In DepthDetails PCBioAssay
TargetPolyadenylate-binding protein 1(Homo sapiens (Human))
Burnham Center For Chemical Genomics
Curated by PubChem BioAssay
LigandPNGBDBM61261(3-(1,3-diketo-4,6-dimethyl-3a,4,7,7a-tetrahydroiso...)
Affinity DataIC50:  6.94E+3nM. Assay description: Data Source: Sanford-Burnham Center for Chemical Genomics (SBCCG) Source Affiliation: Sanford-Burnham Medical Research Institute (SBMRI, San Diego, C...
In DepthDetails PCBioAssay