BDBM61283 MLS000563872::N-[[(E)-3-(2-furanyl)prop-2-enylidene]amino]-2-(4-methylphenoxy)acetamide::N-[[(E)-3-(2-furyl)prop-2-enylidene]amino]-2-(4-methylphenoxy)acetamide::N-[[(E)-3-(furan-2-yl)prop-2-enylidene]amino]-2-(4-methylphenoxy)acetamide::N-[[(E)-3-(furan-2-yl)prop-2-enylidene]amino]-2-(4-methylphenoxy)ethanamide::SMR000175251::cid_11958712::p-Tolyloxy-acetic acid (3-furan-2-yl-allylidene)-hydrazide
SMILES Cc1ccc(OCC(=O)NN=C\C=C\c2ccco2)cc1
InChI Key InChIKey=ZLIKBJDOAKQJLS-QHRYSZJBSA-N
Data  3 IC50
  Tab Delimited (TSV)   2D SDfile   Computed 3D by Vconf -m prep SDfile
Find this compound or compounds like it in BindingDB:
Activity Spreadsheet -- Enzyme Inhibition Constant Data from BindingDB
Found 3 hits for monomerid = 61283
TargetPolyadenylate-binding protein 1(Homo sapiens (Human))
Burnham Center For Chemical Genomics
Curated by PubChem BioAssay
LigandPNGBDBM61283(MLS000563872 | N-[[(E)-3-(2-furanyl)prop-2-enylide...)
Affinity DataIC50:  4.55E+4nM. Assay description: Data Source: Sanford-Burnham Center for Chemical Genomics (SBCCG) Source Affiliation: Sanford-Burnham Medical Research Institute (SBMRI, San Diego, C...
In DepthDetails PCBioAssay
TargetCarboxy-terminal domain RNA polymerase II polypeptide A small phosphatase 1(Homo sapiens (Human))
Burnham Center For Chemical Genomics
Curated by PubChem BioAssay
LigandPNGBDBM61283(MLS000563872 | N-[[(E)-3-(2-furanyl)prop-2-enylide...)
Affinity DataIC50:  6.01E+3nM. Assay description: Data Source: Sanford-Burnham Center for Chemical Genomics (SBCCG) Source Affiliation: Sanford-Burnham Medical Research Institute (SBMRI, San Diego, C...
In DepthDetails PCBioAssay
TargetEukaryotic translation initiation factor 4H(Homo sapiens (Human))
Burnham Center For Chemical Genomics
Curated by PubChem BioAssay
LigandPNGBDBM61283(MLS000563872 | N-[[(E)-3-(2-furanyl)prop-2-enylide...)
Affinity DataIC50:  1.56E+4nM. Assay description: Data Source: Sanford-Burnham Center for Chemical Genomics (SBCCG) Source Affiliation: Sanford-Burnham Medical Research Institute (SBMRI, San Diego, C...
In DepthDetails PCBioAssay