BDBM61297 (8,8-dimethyl-8-azoniabicyclo[3.2.1]octan-3-yl) furan-2-carboxylate;bromide::2-furancarboxylic acid (8,8-dimethyl-8-azoniabicyclo[3.2.1]octan-3-yl) ester;bromide::3-(2-furoyloxy)-8,8-dimethyl-8-azoniabicyclo[3.2.1]octane::MLS000766743::SMR000339639::cid_16195126::furan-2-carboxylic acid (8,8-dimethyl-8-azoniabicyclo[3.2.1]octan-3-yl) ester;bromide
SMILES [H]C12CCC([H])(CC(C1)OC(=O)c1ccco1)[N+]2(C)C
InChI Key InChIKey=IYJCPWYAJVDLMI-UHFFFAOYSA-N
Data  2 IC50
  Tab Delimited (TSV)   2D SDfile   Computed 3D by Vconf -m prep SDfile
Find this compound or compounds like it in BindingDB:
Activity Spreadsheet -- Enzyme Inhibition Constant Data from BindingDB
Found 2 hits for monomerid = 61297
TargetEukaryotic translation initiation factor 4H(Homo sapiens (Human))
Burnham Center For Chemical Genomics
Curated by PubChem BioAssay
LigandPNGBDBM61297((8,8-dimethyl-8-azoniabicyclo[3.2.1]octan-3-yl) fu...)
Affinity DataIC50:  1.00E+5nM. Assay description: Data Source: Sanford-Burnham Center for Chemical Genomics (SBCCG) Source Affiliation: Sanford-Burnham Medical Research Institute (SBMRI, San Diego, C...
In DepthDetails PCBioAssay
TargetPolyadenylate-binding protein 1(Homo sapiens (Human))
Burnham Center For Chemical Genomics
Curated by PubChem BioAssay
LigandPNGBDBM61297((8,8-dimethyl-8-azoniabicyclo[3.2.1]octan-3-yl) fu...)
Affinity DataIC50:  7.77E+3nM. Assay description: Data Source: Sanford-Burnham Center for Chemical Genomics (SBCCG) Source Affiliation: Sanford-Burnham Medical Research Institute (SBMRI, San Diego, C...
In DepthDetails PCBioAssay