BDBM61333 2-[2-[2-(4-isopropoxyphenoxy)ethylthio]benzimidazol-1-yl]acetic acid::2-[2-[2-(4-propan-2-yloxyphenoxy)ethylsulfanyl]benzimidazol-1-yl]acetic acid::2-[2-[2-(4-propan-2-yloxyphenoxy)ethylsulfanyl]benzimidazol-1-yl]ethanoic acid::2-[2-[2-(4-propan-2-yloxyphenoxy)ethylthio]-1-benzimidazolyl]acetic acid::MLS001206765::SMR000523233::cid_2772710::{2-[2-(4-Isopropoxy-phenoxy)-ethylsulfanyl]-benzoimidazol-1-yl}-acetic acid
SMILES CC(C)Oc1ccc(OCCSc2nc3ccccc3n2CC(O)=O)cc1
InChI Key InChIKey=WNMBEZBZKWQNEW-UHFFFAOYSA-N
Data  2 IC50  1 EC50
  Tab Delimited (TSV)   2D SDfile   Computed 3D by Vconf -m prep SDfile
Find this compound or compounds like it in BindingDB:
Activity Spreadsheet -- Enzyme Inhibition Constant Data from BindingDB
Found 3 hits for monomerid = 61333
TargetPolyadenylate-binding protein 1(Homo sapiens (Human))
Burnham Center For Chemical Genomics
Curated by PubChem BioAssay
LigandPNGBDBM61333(2-[2-[2-(4-isopropoxyphenoxy)ethylthio]benzimidazo...)
Affinity DataIC50:  1.15E+4nM. Assay description: Data Source: Sanford-Burnham Center for Chemical Genomics (SBCCG) Source Affiliation: Sanford-Burnham Medical Research Institute (SBMRI, San Diego, C...
In DepthDetails PCBioAssay
TargetHeat shock factor protein 1(Mus musculus)
Broad Institute
Curated by PubChem BioAssay
LigandPNGBDBM61333(2-[2-[2-(4-isopropoxyphenoxy)ethylthio]benzimidazo...)
Affinity DataEC50: >1.95E+5nM. Assay description: Keywords: Heat Shock Factor-1 (HSF-1), Stress Response, MG132, NIH3T3, Luminescence Assay Overview: Modified NIH3T3, transformed to express firefly...
In DepthDetails PCBioAssay
TargetEukaryotic translation initiation factor 4H(Homo sapiens (Human))
Burnham Center For Chemical Genomics
Curated by PubChem BioAssay
LigandPNGBDBM61333(2-[2-[2-(4-isopropoxyphenoxy)ethylthio]benzimidazo...)
Affinity DataIC50:  1.00E+5nM. Assay description: Data Source: Sanford-Burnham Center for Chemical Genomics (SBCCG) Source Affiliation: Sanford-Burnham Medical Research Institute (SBMRI, San Diego, C...
In DepthDetails PCBioAssay