BDBM61387 MLS001034158::N-[1-[4-ethyl-5-[2-oxidanylidene-2-[(phenylmethyl)amino]ethyl]sulfanyl-1,2,4-triazol-3-yl]-2-oxidanyl-ethyl]benzamide::N-[1-[4-ethyl-5-[[2-oxo-2-[(phenylmethyl)amino]ethyl]thio]-1,2,4-triazol-3-yl]-2-hydroxyethyl]benzamide::N-[1-[5-[2-(benzylamino)-2-oxoethyl]sulfanyl-4-ethyl-1,2,4-triazol-3-yl]-2-hydroxyethyl]benzamide::N-[1-[5-[[2-(benzylamino)-2-keto-ethyl]thio]-4-ethyl-1,2,4-triazol-3-yl]-2-hydroxy-ethyl]benzamide::SMR000668971::cid_2967841
SMILES CCn1c(SCC(=O)NCc2ccccc2)nnc1C(CO)NC(=O)c1ccccc1
InChI Key InChIKey=UGBBHIOKRMWMMS-UHFFFAOYSA-N
Data  4 IC50
  Tab Delimited (TSV)   2D SDfile   Computed 3D by Vconf -m prep SDfile
Find this compound or compounds like it in BindingDB:
Activity Spreadsheet -- Enzyme Inhibition Constant Data from BindingDB
Found 4 hits for monomerid = 61387
TargetPolyadenylate-binding protein 1(Homo sapiens (Human))
Burnham Center For Chemical Genomics
Curated by PubChem BioAssay
LigandPNGBDBM61387(MLS001034158 | N-[1-[4-ethyl-5-[2-oxidanylidene-2-...)
Affinity DataIC50:  6.06E+3nM. Assay description: Data Source: Sanford-Burnham Center for Chemical Genomics (SBCCG) Source Affiliation: Sanford-Burnham Medical Research Institute (SBMRI, San Diego, C...
In DepthDetails PCBioAssay
TargetDNA dC->dU-editing enzyme APOBEC-3G(Homo sapiens (Human))
Burnham Center For Chemical Genomics
Curated by PubChem BioAssay
LigandPNGBDBM61387(MLS001034158 | N-[1-[4-ethyl-5-[2-oxidanylidene-2-...)
Affinity DataIC50:  4.48E+3nMT: 2°C. Assay description: Data Source: Sanford-Burnham Center for Chemical Genomics (SBCCG) Source Affiliation: Sanford-Burnham Medical Research Institute (SBMRI, San Diego, C...
In DepthDetails PCBioAssay
TargetDNA dC->dU-editing enzyme APOBEC-3A(Homo sapiens (Human))
Burnham Center For Chemical Genomics
Curated by PubChem BioAssay
LigandPNGBDBM61387(MLS001034158 | N-[1-[4-ethyl-5-[2-oxidanylidene-2-...)
Affinity DataIC50:  3.67E+3nMT: 2°C. Assay description: Data Source: Sanford-Burnham Center for Chemical Genomics (SBCCG) Source Affiliation: Sanford-Burnham Medical Research Institute (SBMRI, San Diego, C...
In DepthDetails PCBioAssay
TargetEukaryotic translation initiation factor 4H(Homo sapiens (Human))
Burnham Center For Chemical Genomics
Curated by PubChem BioAssay
LigandPNGBDBM61387(MLS001034158 | N-[1-[4-ethyl-5-[2-oxidanylidene-2-...)
Affinity DataIC50:  1.00E+5nM. Assay description: Data Source: Sanford-Burnham Center for Chemical Genomics (SBCCG) Source Affiliation: Sanford-Burnham Medical Research Institute (SBMRI, San Diego, C...
In DepthDetails PCBioAssay