BDBM61719 2-[5-carbethoxy-3-(4-morpholinophenyl)pyrazol-1-yl]benzoic acid::2-[5-ethoxycarbonyl-3-(4-morpholin-4-ylphenyl)pyrazol-1-yl]benzoic acid::2-[5-ethoxycarbonyl-3-[4-(4-morpholinyl)phenyl]-1-pyrazolyl]benzoic acid::MLS000759946::SMR000370088::US20230364057, Compound 7::cid_4386631
SMILES CCOC(=O)c1cc(nn1-c1ccccc1C(O)=O)-c1ccc(cc1)N1CCOCC1
InChI Key InChIKey=OHCLTJPHXIFMGW-UHFFFAOYSA-N
Data  7 IC50
  Tab Delimited (TSV)   2D SDfile   Computed 3D by Vconf -m prep SDfile
Find this compound or compounds like it in BindingDB:
Activity Spreadsheet -- Enzyme Inhibition Constant Data from BindingDB
Found 7 hits for monomerid = 61719
TargetVoltage-dependent N-type calcium channel subunit alpha-1B(Homo sapiens (Human))
Burnham Center For Chemical Genomics
Curated by PubChem BioAssay
LigandPNGBDBM61719(2-[5-carbethoxy-3-(4-morpholinophenyl)pyrazol-1-yl...)
Affinity DataIC50:  5.98E+3nM. Assay description: Data Source: Data Source: Sanford-Burnham Center for Chemical Genomics (SBCCG) Source Affiliation: Sanford-Burnham Medical Research Institute Network...
In DepthDetails PCBioAssay
TargetCarboxy-terminal domain RNA polymerase II polypeptide A small phosphatase 1(Homo sapiens (Human))
Burnham Center For Chemical Genomics
Curated by PubChem BioAssay
LigandPNGBDBM61719(2-[5-carbethoxy-3-(4-morpholinophenyl)pyrazol-1-yl...)
Affinity DataIC50:  5.98E+3nM. Assay description: Data Source: Sanford-Burnham Center for Chemical Genomics (SBCCG) Source Affiliation: Sanford-Burnham Medical Research Institute (SBMRI, San Diego, C...
In DepthDetails PCBioAssay
TargetDNA (cytosine-5)-methyltransferase 1(Homo sapiens (Human))
Burnham Center For Chemical Genomics
Curated by PubChem BioAssay
LigandPNGBDBM61719(2-[5-carbethoxy-3-(4-morpholinophenyl)pyrazol-1-yl...)
Affinity DataIC50:  6.99E+3nM. Assay description: Data Source: Sanford-Burnham Center for Chemical Genomics (SBCCG) Source Affiliation: Sanford-Burnham Medical Research Institute (SBMRI, San Diego, C...
In DepthDetails PCBioAssay
TargetDNA gyrase inhibitor()
The Florida International University Board Of Trustees
US Patent
LigandPNGBDBM61719(2-[5-carbethoxy-3-(4-morpholinophenyl)pyrazol-1-yl...)
Affinity DataIC50:  3.75E+4nM. Assay description: SDFQ HTS primary assay using pAB1_FL905 was performed in 2 µL of (1 xDNA gyrase buffer: 20 mM Tris-Acetate pH 7.9, 50 mM KAc, 10 mM MgCl2, 2 mM DTT, ...
In DepthDetails US Patent
TargetLow molecular weight phosphotyrosine protein phosphatase(Homo sapiens (Human))
Burnham Center For Chemical Genomics
Curated by PubChem BioAssay
LigandPNGBDBM61719(2-[5-carbethoxy-3-(4-morpholinophenyl)pyrazol-1-yl...)
Affinity DataIC50: >8.00E+4nM
In DepthDetails PCBioAssay
TargetTyrosine-protein phosphatase non-receptor type 22(Homo sapiens (Human))
Burnham Center For Chemical Genomics
Curated by PubChem BioAssay
LigandPNGBDBM61719(2-[5-carbethoxy-3-(4-morpholinophenyl)pyrazol-1-yl...)
Affinity DataIC50:  8.42E+3nM
In DepthDetails PCBioAssay
TargetLow molecular weight phosphotyrosine protein phosphatase(Homo sapiens (Human))
Burnham Center For Chemical Genomics
Curated by PubChem BioAssay
LigandPNGBDBM61719(2-[5-carbethoxy-3-(4-morpholinophenyl)pyrazol-1-yl...)
Affinity DataIC50:  1.23E+4nM
In DepthDetails PCBioAssay