BDBM61778 2-benzyl-3-[4-(diethylamino)anilino]-3-keto-propionic acid ethyl ester::3-[4-(diethylamino)anilino]-3-oxo-2-(phenylmethyl)propanoic acid ethyl ester::MLS000573081::SMR000185011::cid_2836861::ethyl 2-benzyl-3-[4-(diethylamino)anilino]-3-oxopropanoate::ethyl 2-benzyl-3-{[4-(diethylamino)phenyl]amino}-3-oxopropanoate::ethyl 3-[[4-(diethylamino)phenyl]amino]-3-oxidanylidene-2-(phenylmethyl)propanoate
SMILES CCOC(=O)C(Cc1ccccc1)C(=O)Nc1ccc(cc1)N(CC)CC
InChI Key InChIKey=WRQFVDNJBXVVOP-UHFFFAOYSA-N
Data  4 EC50
  Tab Delimited (TSV)   2D SDfile   Computed 3D by Vconf -m prep SDfile
Find this compound or compounds like it in BindingDB:
Activity Spreadsheet -- Enzyme Inhibition Constant Data from BindingDB
Found 4 hits for monomerid = 61778
TargetNeuropeptide Y receptor type 2(Homo sapiens (Human))
The Scripps Research Institute Molecular Screening Center
Curated by PubChem BioAssay
LigandPNGBDBM61778(2-benzyl-3-[4-(diethylamino)anilino]-3-keto-propio...)
Affinity DataEC50:  2.39E+4nM. Assay description: Source (MLPCN Center Name): The Scripps Research Institute Molecular Screening Center (SRIMSC) Center Affiliation: The Scripps Research Institute (TS...
In DepthDetails PCBioAssay
TargetNeuropeptide Y receptor type 2(Homo sapiens (Human))
The Scripps Research Institute Molecular Screening Center
Curated by PubChem BioAssay
LigandPNGBDBM61778(2-benzyl-3-[4-(diethylamino)anilino]-3-keto-propio...)
Affinity DataEC50:  1.24E+4nM. Assay description: Source (MLPCN Center Name): The Scripps Research Institute Molecular Screening Center (SRIMSC) Center Affiliation: The Scripps Research Institute (TS...
In DepthDetails PCBioAssay
TargetNeuropeptide Y receptor type 1(Homo sapiens (Human))
The Scripps Research Institute Molecular Screening Center
Curated by PubChem BioAssay
LigandPNGBDBM61778(2-benzyl-3-[4-(diethylamino)anilino]-3-keto-propio...)
Affinity DataEC50:  5.40E+3nM. Assay description: Source (MLPCN Center Name): The Scripps Research Institute Molecular Screening Center (SRIMSC) Center Affiliation: The Scripps Research Institute (TS...
In DepthDetails PCBioAssay
TargetNeuropeptide Y receptor type 1(Homo sapiens (Human))
The Scripps Research Institute Molecular Screening Center
Curated by PubChem BioAssay
LigandPNGBDBM61778(2-benzyl-3-[4-(diethylamino)anilino]-3-keto-propio...)
Affinity DataEC50:  7.05E+3nM. Assay description: Source (MLPCN Center Name): The Scripps Research Institute Molecular Screening Center (SRIMSC) Center Affiliation: The Scripps Research Institute (TS...
In DepthDetails PCBioAssay