BDBM61820 4-chloranyl-3-nitro-N-(2-pyrrolidin-1-ylcarbonylphenyl)benzamide::4-chloro-3-nitro-N-[2-(1-pyrrolidinylcarbonyl)phenyl]benzamide::4-chloro-3-nitro-N-[2-(pyrrolidine-1-carbonyl)phenyl]benzamide::4-chloro-3-nitro-N-[2-[oxo(1-pyrrolidinyl)methyl]phenyl]benzamide::MLS000677547::SMR000271706::cid_1326639
SMILES [O-][N+](=O)c1cc(ccc1Cl)C(=O)Nc1ccccc1C(=O)N1CCCC1
InChI Key InChIKey=LEYHSXNQCGYETJ-UHFFFAOYSA-N
Data  1 IC50  2 EC50
  Tab Delimited (TSV)   2D SDfile   Computed 3D by Vconf -m prep SDfile
Find this compound or compounds like it in BindingDB:
Activity Spreadsheet -- Enzyme Inhibition Constant Data from BindingDB
Found 3 hits for monomerid = 61820
TargetNeuropeptide Y receptor type 2(Homo sapiens (Human))
The Scripps Research Institute Molecular Screening Center
Curated by PubChem BioAssay
LigandPNGBDBM61820(4-chloranyl-3-nitro-N-(2-pyrrolidin-1-ylcarbonylph...)
Affinity DataEC50:  2.79E+4nM. Assay description: Source (MLPCN Center Name): The Scripps Research Institute Molecular Screening Center (SRIMSC) Center Affiliation: The Scripps Research Institute (TS...
In DepthDetails PCBioAssay
TargetMelanocortin receptor 4(Homo sapiens (Human))
The Scripps Research Institute Molecular Screening Center
Curated by PubChem BioAssay
LigandPNGBDBM61820(4-chloranyl-3-nitro-N-(2-pyrrolidin-1-ylcarbonylph...)
Affinity DataIC50:  2.06E+4nM. Assay description: Source (MLPCN Center Name): The Scripps Research Institute Molecular Screening Center (SRISMC) Center Affiliation: The Scripps Research Institute, TS...
In DepthDetails PCBioAssay
TargetNeuropeptide Y receptor type 1(Homo sapiens (Human))
The Scripps Research Institute Molecular Screening Center
Curated by PubChem BioAssay
LigandPNGBDBM61820(4-chloranyl-3-nitro-N-(2-pyrrolidin-1-ylcarbonylph...)
Affinity DataEC50:  1.86E+4nM. Assay description: Source (MLPCN Center Name): The Scripps Research Institute Molecular Screening Center (SRIMSC) Center Affiliation: The Scripps Research Institute (TS...
In DepthDetails PCBioAssay