BDBM61838 2-[[2-[(9-ethyl-3-carbazolyl)amino]-2-oxoethyl]-methylamino]-N-[4-(4-morpholinyl)phenyl]acetamide::2-[[2-[(9-ethylcarbazol-3-yl)amino]-2-keto-ethyl]-methyl-amino]-N-(4-morpholinophenyl)acetamide::2-[[2-[(9-ethylcarbazol-3-yl)amino]-2-oxidanylidene-ethyl]-methyl-amino]-N-(4-morpholin-4-ylphenyl)ethanamide::2-[[2-[(9-ethylcarbazol-3-yl)amino]-2-oxoethyl]-methylamino]-N-(4-morpholin-4-ylphenyl)acetamide::MLS000771408::SMR000376859::cid_2521087
SMILES CCn1c2ccccc2c2cc(NC(=O)CN(C)CC(=O)Nc3ccc(cc3)N3CCOCC3)ccc12
InChI Key InChIKey=GFDABDQMFAMKGW-UHFFFAOYSA-N
Data  2 EC50
  Tab Delimited (TSV)   2D SDfile   Computed 3D by Vconf -m prep SDfile
Find this compound or compounds like it in BindingDB:
Activity Spreadsheet -- Enzyme Inhibition Constant Data from BindingDB
Found 2 hits for monomerid = 61838
TargetNeuropeptide Y receptor type 1(Homo sapiens (Human))
The Scripps Research Institute Molecular Screening Center
Curated by PubChem BioAssay
LigandPNGBDBM61838(2-[[2-[(9-ethyl-3-carbazolyl)amino]-2-oxoethyl]-me...)
Affinity DataEC50: >3.54E+4nM. Assay description: Source (MLPCN Center Name): The Scripps Research Institute Molecular Screening Center (SRIMSC) Center Affiliation: The Scripps Research Institute (TS...
In DepthDetails PCBioAssay
TargetNeuropeptide Y receptor type 2(Homo sapiens (Human))
The Scripps Research Institute Molecular Screening Center
Curated by PubChem BioAssay
LigandPNGBDBM61838(2-[[2-[(9-ethyl-3-carbazolyl)amino]-2-oxoethyl]-me...)
Affinity DataEC50: >3.54E+4nM. Assay description: Source (MLPCN Center Name): The Scripps Research Institute Molecular Screening Center (SRIMSC) Center Affiliation: The Scripps Research Institute (TS...
In DepthDetails PCBioAssay