BDBM61872 2-(3-Chloro-phenyl)-2,3-dihydro-1H-perimidine::2-(3-chlorophenyl)-2,3-dihydro-1H-perimidine::MLS001212673::SMR000515757::cid_668461
SMILES Clc1cccc(c1)C1Nc2cccc3cccc(N1)c23
InChI Key InChIKey=XCXOXFRTKQREIB-UHFFFAOYSA-N
Data  2 IC50
  Tab Delimited (TSV)   2D SDfile   Computed 3D by Vconf -m prep SDfile
Find this compound or compounds like it in BindingDB:
Activity Spreadsheet -- Enzyme Inhibition Constant Data from BindingDB
Found 2 hits for monomerid = 61872
TargetBcl-2-like protein 1(Homo sapiens (Human))
The Scripps Research Institute Molecular Screening Center
Curated by PubChem BioAssay
LigandPNGBDBM61872(2-(3-Chloro-phenyl)-2,3-dihydro-1H-perimidine | 2-...)
Affinity DataIC50:  1.09E+5nM. Assay description: Source (MLPCN Center Name): The Scripps Research Institute Molecular Screening Center Affiliation: The Scripps Research Institute, TSRI Assay Provide...
In DepthDetails PCBioAssay
TargetInduced myeloid leukemia cell differentiation protein Mcl-1(Homo sapiens (Human))
The Scripps Research Institute Molecular Screening Center
Curated by PubChem BioAssay
LigandPNGBDBM61872(2-(3-Chloro-phenyl)-2,3-dihydro-1H-perimidine | 2-...)
Affinity DataIC50:  2.86E+4nM. Assay description: Source (MLPCN Center Name): The Scripps Research Institute Molecular Screening Center Affiliation: The Scripps Research Institute, TSRI Assay Provide...
In DepthDetails PCBioAssay