BDBM61873 2-[(3S)-1,1-diketo-2-(3-methoxyphenyl)-6-(trifluoromethyl)-3H-1,2-benzothiazol-3-yl]acetic acid ethyl ester::2-[(3S)-2-(3-methoxyphenyl)-1,1-dioxo-6-(trifluoromethyl)-3H-1,2-benzothiazol-3-yl]acetic acid ethyl ester::MLS000881640::SMR000525278::cid_24747555::ethyl 2-[(3S)-2-(3-methoxyphenyl)-1,1-bis(oxidanylidene)-6-(trifluoromethyl)-3H-1,2-benzothiazol-3-yl]ethanoate::ethyl 2-[(3S)-2-(3-methoxyphenyl)-1,1-dioxo-6-(trifluoromethyl)-3H-1,2-benzothiazol-3-yl]acetate
SMILES CCOC(=O)C[C@@H]1N(c2cccc(OC)c2)S(=O)(=O)c2cc(ccc12)C(F)(F)F
InChI Key InChIKey=YGAMKHBUENIEQN-INIZCTEOSA-N
Data  2 IC50
  Tab Delimited (TSV)   2D SDfile   Computed 3D by Vconf -m prep SDfile
Find this compound or compounds like it in BindingDB:
Activity Spreadsheet -- Enzyme Inhibition Constant Data from BindingDB
Found 2 hits for monomerid = 61873
TargetBcl-2-like protein 1(Homo sapiens (Human))
The Scripps Research Institute Molecular Screening Center
Curated by PubChem BioAssay
LigandPNGBDBM61873(2-[(3S)-1,1-diketo-2-(3-methoxyphenyl)-6-(trifluor...)
Affinity DataIC50:  1.09E+5nM. Assay description: Source (MLPCN Center Name): The Scripps Research Institute Molecular Screening Center Affiliation: The Scripps Research Institute, TSRI Assay Provide...
In DepthDetails PCBioAssay
TargetInduced myeloid leukemia cell differentiation protein Mcl-1(Homo sapiens (Human))
The Scripps Research Institute Molecular Screening Center
Curated by PubChem BioAssay
LigandPNGBDBM61873(2-[(3S)-1,1-diketo-2-(3-methoxyphenyl)-6-(trifluor...)
Affinity DataIC50: >1.09E+5nM. Assay description: Source (MLPCN Center Name): The Scripps Research Institute Molecular Screening Center Affiliation: The Scripps Research Institute, TSRI Assay Provide...
In DepthDetails PCBioAssay