BDBM61913 2-benzyl-6-fluoro-1,2-benzothiazol-3-one::6-fluoranyl-2-(phenylmethyl)-1,2-benzothiazol-3-one::6-fluoro-2-(phenylmethyl)-1,2-benzothiazol-3-one::KUC103852N::cid_1519962
SMILES Fc1ccc2c(c1)sn(Cc1ccccc1)c2=O
InChI Key InChIKey=MNOZTMKEXPKBFS-UHFFFAOYSA-N
Data  2 IC50
  Tab Delimited (TSV)   2D SDfile   Computed 3D by Vconf -m prep SDfile
Find this compound or compounds like it in BindingDB:
Activity Spreadsheet -- Enzyme Inhibition Constant Data from BindingDB
Found 2 hits for monomerid = 61913
TargetPhosphotransferase(Trypanosoma brucei)
University Of Pittsburgh
Curated by PubChem BioAssay
LigandPNGBDBM61913(2-benzyl-6-fluoro-1,2-benzothiazol-3-one | 6-fluor...)
Affinity DataIC50:  2.50E+4nM. Assay description: Excerpt from MH0882340 application (Dr. James Morris, Clemson University) Trypanosoma brucei, the digenic protozoan parasite that causes African slee...
In DepthDetails PCBioAssay
TargetGlucose-6-phosphate 1-dehydrogenase(Leuconostoc mesenteroides)
University Of Pittsburgh
Curated by PubChem BioAssay
LigandPNGBDBM61913(2-benzyl-6-fluoro-1,2-benzothiazol-3-one | 6-fluor...)
Affinity DataIC50: >2.50E+4nM. Assay description: Excerpt from MH082340 application (Dr. James Morris, Clemson University) Trypanosoma brucei, the digenic protozoan parasite that causes African sleep...
In DepthDetails PCBioAssay