BDBM61921 2-(benzylthio)-N-(4-methoxyphenyl)benzamide::2-benzylsulfanyl-N-(4-methoxyphenyl)benzamide::KSC-09-022::KUC103881N::N-(4-methoxyphenyl)-2-(phenylmethylsulfanyl)benzamide::N-(4-methoxyphenyl)-2-(phenylmethylthio)benzamide::cid_8796093
SMILES COc1ccc(NC(=O)c2ccccc2SCc2ccccc2)cc1
InChI Key InChIKey=QPVBICTXOSNCNX-UHFFFAOYSA-N
Data  2 IC50
  Tab Delimited (TSV)   2D SDfile   Computed 3D by Vconf -m prep SDfile
Find this compound or compounds like it in BindingDB:
Activity Spreadsheet -- Enzyme Inhibition Constant Data from BindingDB
Found 2 hits for monomerid = 61921
TargetPhosphotransferase(Trypanosoma brucei)
University Of Pittsburgh
Curated by PubChem BioAssay
LigandPNGBDBM61921(2-(benzylthio)-N-(4-methoxyphenyl)benzamide | 2-be...)
Affinity DataIC50:  2.50E+4nM. Assay description: Excerpt from MH0882340 application (Dr. James Morris, Clemson University) Trypanosoma brucei, the digenic protozoan parasite that causes African slee...
Ligand InfoPC cidPC sid
In DepthDetails PCBioAssay
TargetGlucose-6-phosphate 1-dehydrogenase(Leuconostoc mesenteroides)
University Of Pittsburgh
Curated by PubChem BioAssay
LigandPNGBDBM61921(2-(benzylthio)-N-(4-methoxyphenyl)benzamide | 2-be...)
Affinity DataIC50: >2.50E+4nM. Assay description: Excerpt from MH082340 application (Dr. James Morris, Clemson University) Trypanosoma brucei, the digenic protozoan parasite that causes African sleep...
Ligand InfoPC cidPC sid
In DepthDetails PCBioAssay