BDBM61979 KSC-6-245::KUC105711N::N-(3-chlorophenyl)-4-methoxy-benzamide::N-(3-chlorophenyl)-4-methoxybenzamide::cid_346039
SMILES COc1ccc(cc1)C(=O)Nc1cccc(Cl)c1
InChI Key InChIKey=SPKOXUOZUKBVLV-UHFFFAOYSA-N
Data  2 IC50
  Tab Delimited (TSV)   2D SDfile   Computed 3D by Vconf -m prep SDfile
Find this compound or compounds like it in BindingDB:
Activity Spreadsheet -- Enzyme Inhibition Constant Data from BindingDB
Found 2 hits for monomerid = 61979
TargetPhosphotransferase(Trypanosoma brucei)
University Of Pittsburgh
Curated by PubChem BioAssay
LigandPNGBDBM61979(KSC-6-245 | KUC105711N | N-(3-chlorophenyl)-4-meth...)
Affinity DataIC50:  2.50E+4nM. Assay description: Excerpt from MH0882340 application (Dr. James Morris, Clemson University) Trypanosoma brucei, the digenic protozoan parasite that causes African slee...
In DepthDetails PCBioAssay
TargetGlucose-6-phosphate 1-dehydrogenase(Leuconostoc mesenteroides)
University Of Pittsburgh
Curated by PubChem BioAssay
LigandPNGBDBM61979(KSC-6-245 | KUC105711N | N-(3-chlorophenyl)-4-meth...)
Affinity DataIC50: >2.50E+4nM. Assay description: Excerpt from MH082340 application (Dr. James Morris, Clemson University) Trypanosoma brucei, the digenic protozoan parasite that causes African sleep...
In DepthDetails PCBioAssay