BDBM62026 2-[(4-methoxybenzoyl)amino]-4-methylbenzoic acid::2-[(4-methoxyphenyl)carbonylamino]-4-methyl-benzoic acid::2-[[(4-methoxyphenyl)-oxomethyl]amino]-4-methylbenzoic acid::4-methyl-2-(p-anisoylamino)benzoic acid::KSC-18-028::KUC105995N::cid_46839338
SMILES COc1ccc(cc1)C(=O)Nc1cc(C)ccc1C(O)=O
InChI Key InChIKey=CWWPKGOGUNTZCX-UHFFFAOYSA-N
Data  2 IC50
  Tab Delimited (TSV)   2D SDfile   Computed 3D by Vconf -m prep SDfile
Find this compound or compounds like it in BindingDB:
Activity Spreadsheet -- Enzyme Inhibition Constant Data from BindingDB
Found 2 hits for monomerid = 62026
TargetPhosphotransferase(Trypanosoma brucei)
University Of Pittsburgh
Curated by PubChem BioAssay
LigandPNGBDBM62026(2-[(4-methoxybenzoyl)amino]-4-methylbenzoic acid |...)
Affinity DataIC50:  2.50E+4nM. Assay description: Excerpt from MH0882340 application (Dr. James Morris, Clemson University) Trypanosoma brucei, the digenic protozoan parasite that causes African slee...
In DepthDetails PCBioAssay
TargetGlucose-6-phosphate 1-dehydrogenase(Leuconostoc mesenteroides)
University Of Pittsburgh
Curated by PubChem BioAssay
LigandPNGBDBM62026(2-[(4-methoxybenzoyl)amino]-4-methylbenzoic acid |...)
Affinity DataIC50: >2.50E+4nM. Assay description: Excerpt from MH082340 application (Dr. James Morris, Clemson University) Trypanosoma brucei, the digenic protozoan parasite that causes African sleep...
In DepthDetails PCBioAssay