BDBM62032 4-chloranyl-2-[(4-methylphenyl)carbonylamino]benzoic acid::4-chloro-2-(p-toluoylamino)benzoic acid::4-chloro-2-[(4-methylbenzoyl)amino]benzoic acid::4-chloro-2-[[(4-methylphenyl)-oxomethyl]amino]benzoic acid::KSC-18-040::KUC106001N::cid_16777984
SMILES Cc1ccc(cc1)C(=O)Nc1cc(Cl)ccc1C(O)=O
InChI Key InChIKey=XBGJCWHGWBXESV-UHFFFAOYSA-N
Data  2 IC50
  Tab Delimited (TSV)   2D SDfile   Computed 3D by Vconf -m prep SDfile
Find this compound or compounds like it in BindingDB:
Activity Spreadsheet -- Enzyme Inhibition Constant Data from BindingDB
Found 2 hits for monomerid = 62032
TargetPhosphotransferase(Trypanosoma brucei)
University Of Pittsburgh
Curated by PubChem BioAssay
LigandPNGBDBM62032(4-chloranyl-2-[(4-methylphenyl)carbonylamino]benzo...)
Affinity DataIC50:  1.38E+4nM. Assay description: Excerpt from MH0882340 application (Dr. James Morris, Clemson University) Trypanosoma brucei, the digenic protozoan parasite that causes African slee...
In DepthDetails PCBioAssay
TargetGlucose-6-phosphate 1-dehydrogenase(Leuconostoc mesenteroides)
University Of Pittsburgh
Curated by PubChem BioAssay
LigandPNGBDBM62032(4-chloranyl-2-[(4-methylphenyl)carbonylamino]benzo...)
Affinity DataIC50: >2.50E+4nM. Assay description: Excerpt from MH082340 application (Dr. James Morris, Clemson University) Trypanosoma brucei, the digenic protozoan parasite that causes African sleep...
In DepthDetails PCBioAssay