BDBM62074 1,1'-[(4,6-dimethoxy-1,3-phenylene)disulfonyl]dipiperidine::1-(2,4-dimethoxy-5-piperidin-1-ylsulfonyl-phenyl)sulfonylpiperidine::1-(2,4-dimethoxy-5-piperidin-1-ylsulfonylphenyl)sulfonylpiperidine::1-(2,4-dimethoxy-5-piperidinosulfonyl-phenyl)sulfonylpiperidine::1-[2,4-dimethoxy-5-(1-piperidinylsulfonyl)phenyl]sulfonylpiperidine::MLS000052046::SMR000078608::cid_1506525
SMILES COc1cc(OC)c(cc1S(=O)(=O)N1CCCCC1)S(=O)(=O)N1CCCCC1
InChI Key InChIKey=RKIUZLVAXOZTBO-UHFFFAOYSA-N
Data  3 IC50
  Tab Delimited (TSV)   2D SDfile   Computed 3D by Vconf -m prep SDfile
Find this compound or compounds like it in BindingDB:
Activity Spreadsheet -- Enzyme Inhibition Constant Data from BindingDB
Found 3 hits for monomerid = 62074
TargetNeuropeptides B/W receptor type 1(Homo sapiens (Human))
The Scripps Research Institute Molecular Screening Center
Curated by PubChem BioAssay
LigandPNGBDBM62074(1,1'-[(4,6-dimethoxy-1,3-phenylene)disulfonyl]...)
Affinity DataIC50:  7.02E+3nM. Assay description: Source (MLPCN Center Name): The Scripps Research Institute Molecular Screening Center (SRIMSC) Affiliation: The Scripps Research Institute, TSRI Assa...
In DepthDetails PCBioAssay
TargetNeuropeptides B/W receptor type 1(Homo sapiens (Human))
The Scripps Research Institute Molecular Screening Center
Curated by PubChem BioAssay
LigandPNGBDBM62074(1,1'-[(4,6-dimethoxy-1,3-phenylene)disulfonyl]...)
Affinity DataIC50: >2.00E+4nM. Assay description: Source (MLPCN Center Name): The Scripps Research Institute Molecular Screening Center (SRIMSC) Affiliation: The Scripps Research Institute, TSRI Assa...
In DepthDetails PCBioAssay
TargetMelanin-concentrating hormone receptor 1(Homo sapiens (Human))
The Scripps Research Institute Molecular Screening Center
Curated by PubChem BioAssay
LigandPNGBDBM62074(1,1'-[(4,6-dimethoxy-1,3-phenylene)disulfonyl]...)
Affinity DataIC50: >2.00E+4nM. Assay description: Source (MLPCN Center Name): The Scripps Research Institute Molecular Screening Center (SRIMSC) Affiliation: The Scripps Research Institute, TSRI Assa...
In DepthDetails PCBioAssay