BDBM62093 2-[4-(5-acetyl-6-phenyl-2-sulfanylidene-3,4-dihydro-1H-pyrimidin-4-yl)-2-chloro-6-methoxyphenoxy]acetic acid ethyl ester::2-[4-(5-acetyl-6-phenyl-2-thioxo-3,4-dihydro-1H-pyrimidin-4-yl)-2-chloro-6-methoxy-phenoxy]acetic acid ethyl ester::MLS000578312::SMR000198212::cid_2937930::ethyl 2-[2-chloranyl-4-(5-ethanoyl-6-phenyl-2-sulfanylidene-3,4-dihydro-1H-pyrimidin-4-yl)-6-methoxy-phenoxy]ethanoate::ethyl 2-[4-(5-acetyl-6-phenyl-2-sulfanylidene-3,4-dihydro-1H-pyrimidin-4-yl)-2-chloro-6-methoxyphenoxy]acetate::ethyl [4-(5-acetyl-6-phenyl-2-thioxo-1,2,3,4-tetrahydro-4-pyrimidinyl)-2-chloro-6-methoxyphenoxy]acetate
SMILES CCOC(=O)COc1c(Cl)cc(cc1OC)C1NC(=S)N=C(C1C(C)=O)c1ccccc1
InChI Key InChIKey=GTLGKPCIJYQREE-UHFFFAOYSA-N
Data  1 IC50
  Tab Delimited (TSV)   2D SDfile   Computed 3D by Vconf -m prep SDfile
Find this compound or compounds like it in BindingDB:
Activity Spreadsheet -- Enzyme Inhibition Constant Data from BindingDB
Found 1 hit for monomerid = 62093
TargetNeuropeptides B/W receptor type 1(Homo sapiens (Human))
The Scripps Research Institute Molecular Screening Center
Curated by PubChem BioAssay
LigandPNGBDBM62093(2-[4-(5-acetyl-6-phenyl-2-sulfanylidene-3,4-dihydr...)
Affinity DataIC50:  4.38E+4nM. Assay description: Source (MLPCN Center Name): The Scripps Research Institute Molecular Screening Center (SRIMSC) Affiliation: The Scripps Research Institute, TSRI Assa...
Ligand InfoPC cidPC sid
In DepthDetails PCBioAssay