BDBM62113 (4-morpholin-4-ylcarbothioylphenyl) benzoate::MLS000765909::SMR000279615::[4-(morpholine-4-carbothioyl)phenyl] benzoate::benzoic acid [4-(morpholine-4-carbothioyl)phenyl] ester::benzoic acid [4-[4-morpholinyl(sulfanylidene)methyl]phenyl] ester::cid_780934
SMILES O=C(Oc1ccc(cc1)C(=S)N1CCOCC1)c1ccccc1
InChI Key InChIKey=YFPZCBZKLBEJRO-UHFFFAOYSA-N
Data  1 IC50
  Tab Delimited (TSV)   2D SDfile   Computed 3D by Vconf -m prep SDfile
Find this compound or compounds like it in BindingDB:
Activity Spreadsheet -- Enzyme Inhibition Constant Data from BindingDB
Found 1 hit for monomerid = 62113
TargetNeuropeptides B/W receptor type 1(Homo sapiens (Human))
The Scripps Research Institute Molecular Screening Center
Curated by PubChem BioAssay
LigandPNGBDBM62113((4-morpholin-4-ylcarbothioylphenyl) benzoate | MLS...)
Affinity DataIC50:  4.38E+4nM. Assay description: Source (MLPCN Center Name): The Scripps Research Institute Molecular Screening Center (SRIMSC) Affiliation: The Scripps Research Institute, TSRI Assa...
In DepthDetails PCBioAssay