BDBM62130 2-[({2-[(4-chlorobenzyl)oxy]-1-naphthyl}methyl)amino]-2-methyl-1-propanol::2-[[2-(4-chlorobenzyl)oxy-1-naphthyl]methylamino]-2-methyl-propan-1-ol;hydrochloride::2-[[2-[(4-chlorophenyl)methoxy]-1-naphthalenyl]methylamino]-2-methyl-1-propanol;hydrochloride::2-[[2-[(4-chlorophenyl)methoxy]naphthalen-1-yl]methylamino]-2-methyl-propan-1-ol;hydrochloride::2-[[2-[(4-chlorophenyl)methoxy]naphthalen-1-yl]methylamino]-2-methylpropan-1-ol;hydrochloride::MLS001178722::SMR000477190::cid_2949571
SMILES CC(C)(CO)NCc1c(OCc2ccc(Cl)cc2)ccc2ccccc12
InChI Key InChIKey=VJXKDSOOBCYQHN-UHFFFAOYSA-N
Data  1 IC50
  Tab Delimited (TSV)   2D SDfile   Computed 3D by Vconf -m prep SDfile
Find this compound or compounds like it in BindingDB:
Activity Spreadsheet -- Enzyme Inhibition Constant Data from BindingDB
Found 1 hit for monomerid = 62130
TargetNeuropeptides B/W receptor type 1(Homo sapiens (Human))
The Scripps Research Institute Molecular Screening Center
Curated by PubChem BioAssay
LigandPNGBDBM62130(2-[({2-[(4-chlorobenzyl)oxy]-1-naphthyl}methyl)ami...)
Affinity DataIC50:  7.85E+3nM. Assay description: Source (MLPCN Center Name): The Scripps Research Institute Molecular Screening Center (SRIMSC) Affiliation: The Scripps Research Institute, TSRI Assa...
In DepthDetails PCBioAssay