BDBM62141 1-(4-fluorophenyl)-3-(6-sulfamoyl-1,3-benzothiazol-2-yl)urea::MLS001174994::SMR000595059::cid_9438152
SMILES NS(=O)(=O)c1ccc2nc(NC(=O)Nc3ccc(F)cc3)sc2c1
InChI Key InChIKey=QUYQFUKMMWQSHB-UHFFFAOYSA-N
Data  1 IC50
  Tab Delimited (TSV)   2D SDfile   Computed 3D by Vconf -m prep SDfile
Find this compound or compounds like it in BindingDB:
Activity Spreadsheet -- Enzyme Inhibition Constant Data from BindingDB
Found 1 hit for monomerid = 62141
TargetNeuropeptides B/W receptor type 1(Homo sapiens (Human))
The Scripps Research Institute Molecular Screening Center
Curated by PubChem BioAssay
LigandPNGBDBM62141(1-(4-fluorophenyl)-3-(6-sulfamoyl-1,3-benzothiazol...)
Affinity DataIC50:  4.38E+4nM. Assay description: Source (MLPCN Center Name): The Scripps Research Institute Molecular Screening Center (SRIMSC) Affiliation: The Scripps Research Institute, TSRI Assa...
In DepthDetails PCBioAssay