BDBM62143 5-(2-chloro-6-fluoro-benzyl)-6-keto-N-(3-morpholinopropyl)benzo[b][1,4]benzothiazepine-3-carboxamide::5-[(2-chloranyl-6-fluoranyl-phenyl)methyl]-N-(3-morpholin-4-ylpropyl)-6-oxidanylidene-benzo[b][1,4]benzothiazepine-3-carboxamide::5-[(2-chloro-6-fluorophenyl)methyl]-N-(3-morpholin-4-ylpropyl)-6-oxobenzo[b][1,4]benzothiazepine-3-carboxamide::5-[(2-chloro-6-fluorophenyl)methyl]-N-[3-(4-morpholinyl)propyl]-6-oxo-3-benzo[b][1,4]benzothiazepinecarboxamide::MLS000912771::SMR000622650::cid_20854116
SMILES Fc1cccc(Cl)c1CN1c2cc(ccc2Sc2ccccc2C1=O)C(=O)NCCCN1CCOCC1
InChI Key InChIKey=QUKASTRSHZTBLA-UHFFFAOYSA-N
Data  3 IC50
  Tab Delimited (TSV)   2D SDfile   Computed 3D by Vconf -m prep SDfile
Find this compound or compounds like it in BindingDB:
Activity Spreadsheet -- Enzyme Inhibition Constant Data from BindingDB
Found 3 hits for monomerid = 62143
TargetNeuropeptides B/W receptor type 1(Homo sapiens (Human))
The Scripps Research Institute Molecular Screening Center
Curated by PubChem BioAssay
LigandPNGBDBM62143(5-(2-chloro-6-fluoro-benzyl)-6-keto-N-(3-morpholin...)
Affinity DataIC50:  6.45E+3nM. Assay description: Source (MLPCN Center Name): The Scripps Research Institute Molecular Screening Center (SRIMSC) Affiliation: The Scripps Research Institute, TSRI Assa...
In DepthDetails PCBioAssay
TargetNeuropeptides B/W receptor type 1(Homo sapiens (Human))
The Scripps Research Institute Molecular Screening Center
Curated by PubChem BioAssay
LigandPNGBDBM62143(5-(2-chloro-6-fluoro-benzyl)-6-keto-N-(3-morpholin...)
Affinity DataIC50: >2.00E+4nM. Assay description: Source (MLPCN Center Name): The Scripps Research Institute Molecular Screening Center (SRIMSC) Affiliation: The Scripps Research Institute, TSRI Assa...
In DepthDetails PCBioAssay
TargetMelanin-concentrating hormone receptor 1(Homo sapiens (Human))
The Scripps Research Institute Molecular Screening Center
Curated by PubChem BioAssay
LigandPNGBDBM62143(5-(2-chloro-6-fluoro-benzyl)-6-keto-N-(3-morpholin...)
Affinity DataIC50: >2.00E+4nM. Assay description: Source (MLPCN Center Name): The Scripps Research Institute Molecular Screening Center (SRIMSC) Affiliation: The Scripps Research Institute, TSRI Assa...
In DepthDetails PCBioAssay