BDBM62163 MLS001150506::N-[2-(4-fluorophenyl)-2-(4-morpholinyl)ethyl]-3-[(4-methoxyphenyl)sulfamoyl]benzamide::N-[2-(4-fluorophenyl)-2-morpholin-4-yl-ethyl]-3-[(4-methoxyphenyl)sulfamoyl]benzamide::N-[2-(4-fluorophenyl)-2-morpholin-4-ylethyl]-3-[(4-methoxyphenyl)sulfamoyl]benzamide::N-[2-(4-fluorophenyl)-2-morpholino-ethyl]-3-[(4-methoxyphenyl)sulfamoyl]benzamide::SMR000708666::cid_24818378
SMILES COc1ccc(NS(=O)(=O)c2cccc(c2)C(=O)NCC(N2CCOCC2)c2ccc(F)cc2)cc1
InChI Key InChIKey=NTSGWAOORVBCCT-UHFFFAOYSA-N
Data  1 IC50
  Tab Delimited (TSV)   2D SDfile   Computed 3D by Vconf -m prep SDfile
Find this compound or compounds like it in BindingDB:
Activity Spreadsheet -- Enzyme Inhibition Constant Data from BindingDB
Found 1 hit for monomerid = 62163
TargetNeuropeptides B/W receptor type 1(Homo sapiens (Human))
The Scripps Research Institute Molecular Screening Center
Curated by PubChem BioAssay
LigandPNGBDBM62163(MLS001150506 | N-[2-(4-fluorophenyl)-2-(4-morpholi...)
Affinity DataIC50:  4.38E+4nM. Assay description: Source (MLPCN Center Name): The Scripps Research Institute Molecular Screening Center (SRIMSC) Affiliation: The Scripps Research Institute, TSRI Assa...
In DepthDetails PCBioAssay