BDBM62185 MLS-0075520.0001::N-[1-(cyclohexylcarbamoyl)cyclohexyl]-N-(2-furfuryl)picolinamide::N-[1-(cyclohexylcarbamoyl)cyclohexyl]-N-(furan-2-ylmethyl)pyridine-2-carboxamide::N-[1-[(cyclohexylamino)-oxomethyl]cyclohexyl]-N-(2-furanylmethyl)-2-pyridinecarboxamide::cid_3950926
SMILES O=C(NC1CCCCC1)C1(CCCCC1)N(Cc1ccco1)C(=O)c1ccccn1
InChI Key InChIKey=LKMUXDJRCIBCRA-UHFFFAOYSA-N
Data  3 IC50  4 EC50
  Tab Delimited (TSV)   2D SDfile   Computed 3D by Vconf -m prep SDfile
Find this compound or compounds like it in BindingDB:
Activity Spreadsheet -- Enzyme Inhibition Constant Data from BindingDB
Found 7 hits for monomerid = 62185
TargetMu-type opioid receptor(Homo sapiens (Human))
Burnham Center For Chemical Genomics
Curated by PubChem BioAssay
LigandPNGBDBM62185(MLS-0075520.0001 | N-[1-(cyclohexylcarbamoyl)cyclo...)
Affinity DataIC50: >3.20E+4nM. Assay description: Data Source: Sanford-Burnham Center for Chemical Genomics (SBCCG) Source Affiliation: Sanford-Burnham Medical Research Institute (SBMRI, San Diego, C...
In DepthDetails PCBioAssay
TargetKappa-type opioid receptor(Homo sapiens (Human))
Burnham Center For Chemical Genomics
Curated by PubChem BioAssay
LigandPNGBDBM62185(MLS-0075520.0001 | N-[1-(cyclohexylcarbamoyl)cyclo...)
Affinity DataIC50:  3.20E+4nM. Assay description: Data Source: Sanford-Burnham Center for Chemical Genomics Source Affiliation: Sanford-Burnham Medical Research Institute Network: NIH Molecular Lib...
In DepthDetails PCBioAssay
TargetMu-type opioid receptor(Homo sapiens (Human))
Burnham Center For Chemical Genomics
Curated by PubChem BioAssay
LigandPNGBDBM62185(MLS-0075520.0001 | N-[1-(cyclohexylcarbamoyl)cyclo...)
Affinity DataEC50: >3.20E+4nM. Assay description: Data Source: Sanford-Burnham Center for Chemical Genomics (SBCCG) Source Affiliation: Sanford-Burnham Medical Research Institute (SBMRI, San Diego, C...
In DepthDetails PCBioAssay
TargetKappa-type opioid receptor(Homo sapiens (Human))
Burnham Center For Chemical Genomics
Curated by PubChem BioAssay
LigandPNGBDBM62185(MLS-0075520.0001 | N-[1-(cyclohexylcarbamoyl)cyclo...)
Affinity DataEC50:  821nM. Assay description: Data Source: Sanford-Burnham Center for Chemical Genomics (SBCCG) Source Affiliation: Sanford-Burnham Medical Research Institute (SBMRI, San Diego, C...
In DepthDetails PCBioAssay
TargetKappa-type opioid receptor(Homo sapiens (Human))
Burnham Center For Chemical Genomics
Curated by PubChem BioAssay
LigandPNGBDBM62185(MLS-0075520.0001 | N-[1-(cyclohexylcarbamoyl)cyclo...)
Affinity DataEC50:  125nM. Assay description: Data Source: Sanford-Burnham Center for Chemical Genomics Source Affiliation: Sanford-Burnham Medical Research Institute Network: NIH Molecular Lib...
In DepthDetails PCBioAssay
TargetDelta-type opioid receptor(Homo sapiens (Human))
Burnham Center For Chemical Genomics
Curated by PubChem BioAssay
LigandPNGBDBM62185(MLS-0075520.0001 | N-[1-(cyclohexylcarbamoyl)cyclo...)
Affinity DataEC50: >3.20E+4nM. Assay description: Data Source: Sanford-Burnham Center for Chemical Genomics (SBCCG) Source Affiliation: Sanford-Burnham Medical Research Institute (SBMRI, San Diego, C...
In DepthDetails PCBioAssay
TargetDelta-type opioid receptor(Homo sapiens (Human))
Burnham Center For Chemical Genomics
Curated by PubChem BioAssay
LigandPNGBDBM62185(MLS-0075520.0001 | N-[1-(cyclohexylcarbamoyl)cyclo...)
Affinity DataIC50:  3.20E+4nM. Assay description: Data Source: Sanford-Burnham Center for Chemical Genomics (SBCCG) Source Affiliation: Sanford-Burnham Medical Research Institute (SBMRI, San Diego, C...
In DepthDetails PCBioAssay