BDBM62231 MLS-0412034.0001::N-(4-chloranyl-3-nitro-phenyl)-1-oxidanyl-naphthalene-2-carboxamide::N-(4-chloro-3-nitro-phenyl)-1-hydroxy-2-naphthamide::N-(4-chloro-3-nitrophenyl)-1-hydroxy-2-naphthalenecarboxamide::N-(4-chloro-3-nitrophenyl)-1-hydroxynaphthalene-2-carboxamide::cid_830837
SMILES Oc1c(ccc2ccccc12)C(=O)Nc1ccc(Cl)c(c1)[N+]([O-])=O
InChI Key InChIKey=LGCWJBIGWQYBJP-UHFFFAOYSA-N
Data  2 IC50
  Tab Delimited (TSV)   2D SDfile   Computed 3D by Vconf -m prep SDfile
Find this compound or compounds like it in BindingDB:
Activity Spreadsheet -- Enzyme Inhibition Constant Data from BindingDB
Found 2 hits for monomerid = 62231
TargetTumor necrosis factor(Homo sapiens (Human))
Burnham Center For Chemical Genomics
Curated by PubChem BioAssay
LigandPNGBDBM62231(MLS-0412034.0001 | N-(4-chloranyl-3-nitro-phenyl)-...)
Affinity DataIC50:  870nM. Assay description: Data Source: Sanford-Burnham Center for Chemical Genomics (SBCCG) Source Affiliation: Sanford-Burnham Medical Research Institute (SBMRI, San Diego, C...
In DepthDetails PCBioAssay
TargetNucleotide-binding oligomerization domain-containing protein 1(Homo sapiens (Human))
Burnham Center For Chemical Genomics
Curated by PubChem BioAssay
LigandPNGBDBM62231(MLS-0412034.0001 | N-(4-chloranyl-3-nitro-phenyl)-...)
Affinity DataIC50:  692nM. Assay description: Data Source: Sanford-Burnham Center for Chemical Genomics (SBCCG) Source Affiliation: Sanford-Burnham Medical Research Institute (SBMRI, San Diego, C...
In DepthDetails PCBioAssay