BDBM62352 2-[(5-methyl-2-furoyl)amino]-4,5,6,7-tetrahydrobenzothiophene-3-carboxylic acid::2-[(5-methylfuran-2-carbonyl)amino]-4,5,6,7-tetrahydro-1-benzothiophene-3-carboxylic acid::2-[(5-methylfuran-2-yl)carbonylamino]-4,5,6,7-tetrahydro-1-benzothiophene-3-carboxylic acid::2-[[(5-methyl-2-furanyl)-oxomethyl]amino]-4,5,6,7-tetrahydro-1-benzothiophene-3-carboxylic acid::MLS-0377708.0001::cid_675357
SMILES Cc1ccc(o1)C(=O)Nc1sc2CCCCc2c1C(O)=O
InChI Key InChIKey=BBVJBJSJRUEXJN-UHFFFAOYSA-N
Data  3 IC50
  Tab Delimited (TSV)   2D SDfile   Computed 3D by Vconf -m prep SDfile
Find this compound or compounds like it in BindingDB:
Activity Spreadsheet -- Enzyme Inhibition Constant Data from BindingDB
Found 3 hits for monomerid = 62352
TargetNucleotide-binding oligomerization domain-containing protein 1(Homo sapiens (Human))
Burnham Center For Chemical Genomics
Curated by PubChem BioAssay
LigandPNGBDBM62352(2-[(5-methyl-2-furoyl)amino]-4,5,6,7-tetrahydroben...)
Affinity DataIC50:  2.00E+4nM. Assay description: Data Source: Sanford-Burnham Center for Chemical Genomics (SBCCG) Source Affiliation: Sanford-Burnham Medical Research Institute (SBMRI, San Diego, C...
In DepthDetails PCBioAssay
TargetTumor necrosis factor(Homo sapiens (Human))
Burnham Center For Chemical Genomics
Curated by PubChem BioAssay
LigandPNGBDBM62352(2-[(5-methyl-2-furoyl)amino]-4,5,6,7-tetrahydroben...)
Affinity DataIC50: >2.00E+4nM. Assay description: Data Source: Sanford-Burnham Center for Chemical Genomics (SBCCG) Source Affiliation: Sanford-Burnham Medical Research Institute (SBMRI, San Diego, C...
In DepthDetails PCBioAssay
TargetNucleotide-binding oligomerization domain-containing protein 2(Homo sapiens (Human))
Burnham Center For Chemical Genomics
Curated by PubChem BioAssay
LigandPNGBDBM62352(2-[(5-methyl-2-furoyl)amino]-4,5,6,7-tetrahydroben...)
Affinity DataIC50:  2.00E+4nM. Assay description: Data Source: Sanford-Burnham Center for Chemical Genomics (SBCCG) Source Affiliation: Sanford-Burnham Medical Research Institute (SBMRI, San Diego, C...
In DepthDetails PCBioAssay