BDBM62357 2-[2-(butylamino)ethanoylamino]-4,5,6,7-tetrahydro-1-benzothiophene-3-carboxylic acid::2-[[2-(butylamino)-1-oxoethyl]amino]-4,5,6,7-tetrahydro-1-benzothiophene-3-carboxylic acid::2-[[2-(butylamino)acetyl]amino]-4,5,6,7-tetrahydro-1-benzothiophene-3-carboxylic acid::2-[[2-(butylamino)acetyl]amino]-4,5,6,7-tetrahydrobenzothiophene-3-carboxylic acid::MLS-0435422.0001::cid_16486753
SMILES CCCCNCC(=O)Nc1sc2CCCCc2c1C(O)=O
InChI Key InChIKey=FSNQRQDYGNNDFH-UHFFFAOYSA-N
Data  3 IC50
  Tab Delimited (TSV)   2D SDfile   Computed 3D by Vconf -m prep SDfile
Find this compound or compounds like it in BindingDB:
Activity Spreadsheet -- Enzyme Inhibition Constant Data from BindingDB
Found 3 hits for monomerid = 62357
TargetNucleotide-binding oligomerization domain-containing protein 1(Homo sapiens (Human))
Burnham Center For Chemical Genomics
Curated by PubChem BioAssay
LigandPNGBDBM62357(2-[2-(butylamino)ethanoylamino]-4,5,6,7-tetrahydro...)
Affinity DataIC50:  2.00E+4nM. Assay description: Data Source: Sanford-Burnham Center for Chemical Genomics (SBCCG) Source Affiliation: Sanford-Burnham Medical Research Institute (SBMRI, San Diego, C...
In DepthDetails PCBioAssay
TargetTumor necrosis factor(Homo sapiens (Human))
Burnham Center For Chemical Genomics
Curated by PubChem BioAssay
LigandPNGBDBM62357(2-[2-(butylamino)ethanoylamino]-4,5,6,7-tetrahydro...)
Affinity DataIC50: >2.00E+4nM. Assay description: Data Source: Sanford-Burnham Center for Chemical Genomics (SBCCG) Source Affiliation: Sanford-Burnham Medical Research Institute (SBMRI, San Diego, C...
In DepthDetails PCBioAssay
TargetNucleotide-binding oligomerization domain-containing protein 2(Homo sapiens (Human))
Burnham Center For Chemical Genomics
Curated by PubChem BioAssay
LigandPNGBDBM62357(2-[2-(butylamino)ethanoylamino]-4,5,6,7-tetrahydro...)
Affinity DataIC50:  2.00E+4nM. Assay description: Data Source: Sanford-Burnham Center for Chemical Genomics (SBCCG) Source Affiliation: Sanford-Burnham Medical Research Institute (SBMRI, San Diego, C...
In DepthDetails PCBioAssay