BDBM62373 MLS-0435447.0001::N-[1-(4-chlorobenzyl)benzimidazol-2-yl]-2-phenyl-acetamide::N-[1-[(4-chlorophenyl)methyl]-2-benzimidazolyl]-2-phenylacetamide::N-[1-[(4-chlorophenyl)methyl]benzimidazol-2-yl]-2-phenyl-ethanamide::N-[1-[(4-chlorophenyl)methyl]benzimidazol-2-yl]-2-phenylacetamide::cid_44543516
SMILES Clc1ccc(Cn2c(NC(=O)Cc3ccccc3)nc3ccccc23)cc1
InChI Key InChIKey=SAGMFVUAZSXJMJ-UHFFFAOYSA-N
Data  3 IC50
  Tab Delimited (TSV)   2D SDfile   Computed 3D by Vconf -m prep SDfile
Find this compound or compounds like it in BindingDB:
Activity Spreadsheet -- Enzyme Inhibition Constant Data from BindingDB
Found 3 hits for monomerid = 62373
TargetNucleotide-binding oligomerization domain-containing protein 1(Homo sapiens (Human))
Burnham Center For Chemical Genomics
Curated by PubChem BioAssay
LigandPNGBDBM62373(MLS-0435447.0001 | N-[1-(4-chlorobenzyl)benzimidaz...)
Affinity DataIC50:  2.00E+4nM. Assay description: Data Source: Sanford-Burnham Center for Chemical Genomics (SBCCG) Source Affiliation: Sanford-Burnham Medical Research Institute (SBMRI, San Diego, C...
In DepthDetails PCBioAssay
TargetTumor necrosis factor(Homo sapiens (Human))
Burnham Center For Chemical Genomics
Curated by PubChem BioAssay
LigandPNGBDBM62373(MLS-0435447.0001 | N-[1-(4-chlorobenzyl)benzimidaz...)
Affinity DataIC50: >2.00E+4nM. Assay description: Data Source: Sanford-Burnham Center for Chemical Genomics (SBCCG) Source Affiliation: Sanford-Burnham Medical Research Institute (SBMRI, San Diego, C...
In DepthDetails PCBioAssay
TargetNucleotide-binding oligomerization domain-containing protein 2(Homo sapiens (Human))
Burnham Center For Chemical Genomics
Curated by PubChem BioAssay
LigandPNGBDBM62373(MLS-0435447.0001 | N-[1-(4-chlorobenzyl)benzimidaz...)
Affinity DataIC50:  2.00E+4nM. Assay description: Data Source: Sanford-Burnham Center for Chemical Genomics (SBCCG) Source Affiliation: Sanford-Burnham Medical Research Institute (SBMRI, San Diego, C...
In DepthDetails PCBioAssay