BDBM62381 MLS-0435455.0001::N-(1-tosylbenzimidazol-2-yl)acetamide::N-[1-(4-methylphenyl)sulfonyl-2-benzimidazolyl]acetamide::N-[1-(4-methylphenyl)sulfonylbenzimidazol-2-yl]acetamide::N-[1-(4-methylphenyl)sulfonylbenzimidazol-2-yl]ethanamide::cid_44543523
SMILES CC(=O)Nc1nc2ccccc2n1S(=O)(=O)c1ccc(C)cc1
InChI Key InChIKey=IOHOARZRIYTCHM-UHFFFAOYSA-N
Data  3 IC50
  Tab Delimited (TSV)   2D SDfile   Computed 3D by Vconf -m prep SDfile
Find this compound or compounds like it in BindingDB:
Activity Spreadsheet -- Enzyme Inhibition Constant Data from BindingDB
Found 3 hits for monomerid = 62381
TargetNucleotide-binding oligomerization domain-containing protein 1(Homo sapiens (Human))
Burnham Center For Chemical Genomics
Curated by PubChem BioAssay
LigandPNGBDBM62381(MLS-0435455.0001 | N-(1-tosylbenzimidazol-2-yl)ace...)
Affinity DataIC50:  3.80E+3nM. Assay description: Data Source: Sanford-Burnham Center for Chemical Genomics (SBCCG) Source Affiliation: Sanford-Burnham Medical Research Institute (SBMRI, San Diego, C...
In DepthDetails PCBioAssay
TargetTumor necrosis factor(Homo sapiens (Human))
Burnham Center For Chemical Genomics
Curated by PubChem BioAssay
LigandPNGBDBM62381(MLS-0435455.0001 | N-(1-tosylbenzimidazol-2-yl)ace...)
Affinity DataIC50: >2.00E+4nM. Assay description: Data Source: Sanford-Burnham Center for Chemical Genomics (SBCCG) Source Affiliation: Sanford-Burnham Medical Research Institute (SBMRI, San Diego, C...
In DepthDetails PCBioAssay
TargetNucleotide-binding oligomerization domain-containing protein 2(Homo sapiens (Human))
Burnham Center For Chemical Genomics
Curated by PubChem BioAssay
LigandPNGBDBM62381(MLS-0435455.0001 | N-(1-tosylbenzimidazol-2-yl)ace...)
Affinity DataIC50:  2.00E+4nM. Assay description: Data Source: Sanford-Burnham Center for Chemical Genomics (SBCCG) Source Affiliation: Sanford-Burnham Medical Research Institute (SBMRI, San Diego, C...
In DepthDetails PCBioAssay