BDBM62422 2-[3-(2,3-Dihydro-benzo[1,4]dioxin-6-yl)-6-oxo-6H-pyridazin-1-yl]-N-(3-ethoxy-phenyl)-acetamide::2-[3-(2,3-dihydro-1,4-benzodioxin-6-yl)-6-keto-pyridazin-1-yl]-N-m-phenetyl-acetamide::2-[3-(2,3-dihydro-1,4-benzodioxin-6-yl)-6-oxidanylidene-pyridazin-1-yl]-N-(3-ethoxyphenyl)ethanamide::2-[3-(2,3-dihydro-1,4-benzodioxin-6-yl)-6-oxo-1-pyridazinyl]-N-(3-ethoxyphenyl)acetamide::2-[3-(2,3-dihydro-1,4-benzodioxin-6-yl)-6-oxopyridazin-1-yl]-N-(3-ethoxyphenyl)acetamide::MLS000122621::SMR000120016::cid_3224511
SMILES CCOc1cccc(NC(=O)Cn2nc(ccc2=O)-c2ccc3OCCOc3c2)c1
InChI Key InChIKey=LFQHUEKEUQPMIQ-UHFFFAOYSA-N
Data  2 IC50
  Tab Delimited (TSV)   2D SDfile   Computed 3D by Vconf -m prep SDfile
Find this compound or compounds like it in BindingDB:
Activity Spreadsheet -- Enzyme Inhibition Constant Data from BindingDB
Found 2 hits for monomerid = 62422
TargetEpstein-Barr nuclear antigen 1(Human herpesvirus 4)
The Scripps Research Institute Molecular Screening Center
Curated by PubChem BioAssay
LigandPNGBDBM62422(2-[3-(2,3-Dihydro-benzo[1,4]dioxin-6-yl)-6-oxo-6H-...)
Affinity DataIC50:  1.37E+4nM. Assay description: Source (MLPCN Center Name): The Scripps Research Institute Molecular Screening Center (SRIMSC) Center Affiliation: The Scripps Research Institute (TS...
In DepthDetails PCBioAssay
TargetTrans-activator protein BZLF1(Human herpesvirus 4)
The Scripps Research Institute Molecular Screening Center
Curated by PubChem BioAssay
LigandPNGBDBM62422(2-[3-(2,3-Dihydro-benzo[1,4]dioxin-6-yl)-6-oxo-6H-...)
Affinity DataIC50:  1.11E+5nM. Assay description: Source (MLPCN Center Name): The Scripps Research Institute Molecular Screening Center (SRIMSC) Center Affiliation: The Scripps Research Institute (TS...
In DepthDetails PCBioAssay