BDBM62429 3,4,5-triethoxybenzoic acid [2-(4-amino-1,3-dimethyl-2,6-dioxo-5-pyrimidinyl)-2-oxoethyl] ester::3,4,5-triethoxybenzoic acid [2-(4-amino-2,6-diketo-1,3-dimethyl-pyrimidin-5-yl)-2-keto-ethyl] ester::MLS000564829::SMR000152088::[2-(4-amino-1,3-dimethyl-2,6-dioxopyrimidin-5-yl)-2-oxoethyl] 3,4,5-triethoxybenzoate::[2-[4-azanyl-1,3-dimethyl-2,6-bis(oxidanylidene)pyrimidin-5-yl]-2-oxidanylidene-ethyl] 3,4,5-triethoxybenzoate::cid_2370402
SMILES CCOc1cc(cc(OCC)c1OCC)C(=O)OCC(=O)c1c(N)n(C)c(=O)n(C)c1=O
InChI Key InChIKey=CBQCMJFMRYSLPD-UHFFFAOYSA-N
Data  2 IC50
  Tab Delimited (TSV)   2D SDfile   Computed 3D by Vconf -m prep SDfile
Find this compound or compounds like it in BindingDB:
Activity Spreadsheet -- Enzyme Inhibition Constant Data from BindingDB
Found 2 hits for monomerid = 62429
TargetEpstein-Barr nuclear antigen 1(Human herpesvirus 4)
The Scripps Research Institute Molecular Screening Center
Curated by PubChem BioAssay
LigandPNGBDBM62429(3,4,5-triethoxybenzoic acid [2-(4-amino-1,3-dimeth...)
Affinity DataIC50:  1.93E+4nM. Assay description: Source (MLPCN Center Name): The Scripps Research Institute Molecular Screening Center (SRIMSC) Center Affiliation: The Scripps Research Institute (TS...
In DepthDetails PCBioAssay
TargetTrans-activator protein BZLF1(Human herpesvirus 4)
The Scripps Research Institute Molecular Screening Center
Curated by PubChem BioAssay
LigandPNGBDBM62429(3,4,5-triethoxybenzoic acid [2-(4-amino-1,3-dimeth...)
Affinity DataIC50:  1.11E+5nM. Assay description: Source (MLPCN Center Name): The Scripps Research Institute Molecular Screening Center (SRIMSC) Center Affiliation: The Scripps Research Institute (TS...
In DepthDetails PCBioAssay