BDBM62441 (5,6-Dimethyl-thieno[2,3-d]pyrimidin-4-ylsulfanyl)-acetic acid N'-[2-(naphthalen-1-yloxy)-acetyl]-hydrazide::MLS000555338::N'-[2-(5,6-dimethylthieno[2,3-d]pyrimidin-4-yl)sulfanylacetyl]-2-naphthalen-1-yloxyacetohydrazide::N'-[2-(5,6-dimethylthieno[2,3-d]pyrimidin-4-yl)sulfanylethanoyl]-2-naphthalen-1-yloxy-ethanehydrazide::N'-[2-[(5,6-dimethyl-4-thieno[2,3-d]pyrimidinyl)thio]-1-oxoethyl]-2-(1-naphthalenyloxy)acetohydrazide::N'-[2-[(5,6-dimethylthieno[2,3-d]pyrimidin-4-yl)thio]acetyl]-2-(1-naphthoxy)acetohydrazide::SMR000172495::cid_3167530
SMILES Cc1sc2ncnc(SCC(=O)NNC(=O)COc3cccc4ccccc34)c2c1C
InChI Key InChIKey=DLSURAUEEASJAH-UHFFFAOYSA-N
Data  2 IC50
  Tab Delimited (TSV)   2D SDfile   Computed 3D by Vconf -m prep SDfile
Find this compound or compounds like it in BindingDB:
Activity Spreadsheet -- Enzyme Inhibition Constant Data from BindingDB
Found 2 hits for monomerid = 62441
TargetEpstein-Barr nuclear antigen 1(Human herpesvirus 4)
The Scripps Research Institute Molecular Screening Center
Curated by PubChem BioAssay
LigandPNGBDBM62441((5,6-Dimethyl-thieno[2,3-d]pyrimidin-4-ylsulfanyl)...)
Affinity DataIC50:  2.02E+3nM. Assay description: Source (MLPCN Center Name): The Scripps Research Institute Molecular Screening Center (SRIMSC) Center Affiliation: The Scripps Research Institute (TS...
In DepthDetails PCBioAssay
TargetTrans-activator protein BZLF1(Human herpesvirus 4)
The Scripps Research Institute Molecular Screening Center
Curated by PubChem BioAssay
LigandPNGBDBM62441((5,6-Dimethyl-thieno[2,3-d]pyrimidin-4-ylsulfanyl)...)
Affinity DataIC50:  1.11E+5nM. Assay description: Source (MLPCN Center Name): The Scripps Research Institute Molecular Screening Center (SRIMSC) Center Affiliation: The Scripps Research Institute (TS...
In DepthDetails PCBioAssay