BDBM62491 3-methoxy-N-[8-(2-nitrophenyl)-2-thiazolo[4,5-e][1,2]benzoxazolyl]benzamide::3-methoxy-N-[8-(2-nitrophenyl)-[1,3]thiazolo[4,5-e][1,2]benzoxazol-2-yl]benzamide::3-methoxy-N-[8-(2-nitrophenyl)thiazol[4,5-e]indoxazen-2-yl]benzamide::MLS000877597::SMR000463852::cid_16746049
SMILES COc1cccc(c1)C(=O)Nc1nc2c(ccc3onc(-c4ccccc4[N+]([O-])=O)c23)s1
InChI Key InChIKey=YXEGXVWXMZZREN-UHFFFAOYSA-N
Data  2 IC50
  Tab Delimited (TSV)   2D SDfile   Computed 3D by Vconf -m prep SDfile
Find this compound or compounds like it in BindingDB:
Activity Spreadsheet -- Enzyme Inhibition Constant Data from BindingDB
Found 2 hits for monomerid = 62491
TargetEpstein-Barr nuclear antigen 1(Human herpesvirus 4)
The Scripps Research Institute Molecular Screening Center
Curated by PubChem BioAssay
LigandPNGBDBM62491(3-methoxy-N-[8-(2-nitrophenyl)-2-thiazolo[4,5-e][1...)
Affinity DataIC50:  1.84E+4nM. Assay description: Source (MLPCN Center Name): The Scripps Research Institute Molecular Screening Center (SRIMSC) Center Affiliation: The Scripps Research Institute (TS...
Ligand InfoPC cidPC sid
In DepthDetails PCBioAssay
TargetTrans-activator protein BZLF1(Human herpesvirus 4)
The Scripps Research Institute Molecular Screening Center
Curated by PubChem BioAssay
LigandPNGBDBM62491(3-methoxy-N-[8-(2-nitrophenyl)-2-thiazolo[4,5-e][1...)
Affinity DataIC50:  1.11E+5nM. Assay description: Source (MLPCN Center Name): The Scripps Research Institute Molecular Screening Center (SRIMSC) Center Affiliation: The Scripps Research Institute (TS...
Ligand InfoPC cidPC sid
In DepthDetails PCBioAssay