BDBM62519 5-methoxy-3-methyl-N-(1,3-thiazol-2-yl)-1-benzofuran-2-carboxamide::5-methoxy-3-methyl-N-(2-thiazolyl)-2-benzofurancarboxamide::5-methoxy-3-methyl-N-thiazol-2-yl-coumarilamide::MLS001161559::SMR000715157::cid_2679217
SMILES COc1ccc2oc(C(=O)Nc3nccs3)c(C)c2c1
InChI Key InChIKey=ASEAPAQCRCSWJA-UHFFFAOYSA-N
Data  2 IC50  1 EC50
  Tab Delimited (TSV)   2D SDfile   Computed 3D by Vconf -m prep SDfile
Find this compound or compounds like it in BindingDB:
Activity Spreadsheet -- Enzyme Inhibition Constant Data from BindingDB
Found 3 hits for monomerid = 62519
TargetTrans-activator protein BZLF1(Human herpesvirus 4)
The Scripps Research Institute Molecular Screening Center
Curated by PubChem BioAssay
LigandPNGBDBM62519(5-methoxy-3-methyl-N-(1,3-thiazol-2-yl)-1-benzofur...)
Affinity DataIC50:  1.11E+5nM. Assay description: Source (MLPCN Center Name): The Scripps Research Institute Molecular Screening Center (SRIMSC) Center Affiliation: The Scripps Research Institute (TS...
In DepthDetails PCBioAssay
TargetOxysterols receptor LXR-beta(Homo sapiens (Human))
The Scripps Research Institute Molecular Screening Center
Curated by PubChem BioAssay
LigandPNGBDBM62519(5-methoxy-3-methyl-N-(1,3-thiazol-2-yl)-1-benzofur...)
Affinity DataEC50:  6.75E+4nM. Assay description: Source (MLPCN Center Name): The Scripps Research Institute Molecular Screening Center Affiliation: UT Southwestern Assay Provider: David Mangelsdorf,...
In DepthDetails PCBioAssay
TargetEpstein-Barr nuclear antigen 1(Human herpesvirus 4)
The Scripps Research Institute Molecular Screening Center
Curated by PubChem BioAssay
LigandPNGBDBM62519(5-methoxy-3-methyl-N-(1,3-thiazol-2-yl)-1-benzofur...)
Affinity DataIC50:  2.10E+4nM. Assay description: Source (MLPCN Center Name): The Scripps Research Institute Molecular Screening Center (SRIMSC) Center Affiliation: The Scripps Research Institute (TS...
In DepthDetails PCBioAssay