BDBM62524 2-[2-(2-Methyl-2,3-dihydro-indol-1-yl)-2-oxo-ethylsulfanyl]-nicotinic acid::2-[2-(2-methyl-2,3-dihydroindol-1-yl)-2-oxidanylidene-ethyl]sulfanylpyridine-3-carboxylic acid::2-[2-(2-methyl-2,3-dihydroindol-1-yl)-2-oxoethyl]sulfanylpyridine-3-carboxylic acid::2-[[2-(2-methyl-2,3-dihydroindol-1-yl)-2-oxoethyl]thio]-3-pyridinecarboxylic acid::2-[[2-keto-2-(2-methylindolin-1-yl)ethyl]thio]nicotinic acid::MLS000035777::SMR000003418::cid_644588
SMILES CC1Cc2ccccc2N1C(=O)CSc1ncccc1C(O)=O
InChI Key InChIKey=FVJCQMLQKRCOGS-UHFFFAOYSA-N
Data  1 EC50
  Tab Delimited (TSV)   2D SDfile   Computed 3D by Vconf -m prep SDfile
Find this compound or compounds like it in BindingDB:
Activity Spreadsheet -- Enzyme Inhibition Constant Data from BindingDB
Found 1 hit for monomerid = 62524
TargetHeat shock factor protein 1(Mus musculus)
Broad Institute
Curated by PubChem BioAssay
LigandPNGBDBM62524(2-[2-(2-Methyl-2,3-dihydro-indol-1-yl)-2-oxo-ethyl...)
Affinity DataEC50: >1.95E+5nM. Assay description: Keywords: Heat Shock Factor-1 (HSF-1), Stress Response, MG132, NIH3T3, Luminescence Assay Overview: Modified NIH3T3, transformed to express firefly...
Ligand InfoPC cidPC sid
In DepthDetails PCBioAssay