BDBM62681 5-amino-1-(2,3-dihydro-1,4-benzodioxin-6-yl)-N-[2-(3,4-dimethoxyphenyl)ethyl]-1H-1,2,3-triazole-4-carboxamide::5-amino-1-(2,3-dihydro-1,4-benzodioxin-6-yl)-N-[2-(3,4-dimethoxyphenyl)ethyl]-4-triazolecarboxamide::5-amino-1-(2,3-dihydro-1,4-benzodioxin-6-yl)-N-[2-(3,4-dimethoxyphenyl)ethyl]triazole-4-carboxamide::5-amino-1-(2,3-dihydro-1,4-benzodioxin-6-yl)-N-homoveratryl-triazole-4-carboxamide::5-azanyl-1-(2,3-dihydro-1,4-benzodioxin-6-yl)-N-[2-(3,4-dimethoxyphenyl)ethyl]-1,2,3-triazole-4-carboxamide::MLS000094772::SMR000030325::cid_3240166
SMILES COc1ccc(CCNC(=O)c2nnn(c2N)-c2ccc3OCCOc3c2)cc1OC
InChI Key InChIKey=GFTDUGFNPKHYDV-UHFFFAOYSA-N
Data  6 IC50  1 EC50
  Tab Delimited (TSV)   2D SDfile   Computed 3D by Vconf -m prep SDfile
Find this compound or compounds like it in BindingDB:
Activity Spreadsheet -- Enzyme Inhibition Constant Data from BindingDB
Found 7 hits for monomerid = 62681
TargetHeat shock factor protein 1(Mus musculus)
Broad Institute
Curated by PubChem BioAssay
LigandPNGBDBM62681(5-amino-1-(2,3-dihydro-1,4-benzodioxin-6-yl)-N-[2-...)
Affinity DataEC50:  440nM. Assay description: Keywords: Heat Shock Factor-1 (HSF-1), Stress Response, MG132, NIH3T3, Luminescence Assay Overview: Modified NIH3T3, transformed to express firefly...
Ligand InfoPC cidPC sid
In DepthDetails PCBioAssay
TargetDNA damage-inducible transcript 3 protein(Mus musculus)
Emory University
Curated by PubChem BioAssay
LigandPNGBDBM62681(5-amino-1-(2,3-dihydro-1,4-benzodioxin-6-yl)-N-[2-...)
Affinity DataIC50:  690nM. Assay description: NIH Molecular Libraries Screening Centers Network [MLSCN] Emory Chemical Biology Discovery Center in MLSCN Assay provider: Dr. Randal Kaufman, Univer...
Ligand InfoPC cidPC sid
In DepthDetails PCBioAssay
TargetX-box-binding protein 1(Homo sapiens (Human))
Emory University
Curated by PubChem BioAssay
LigandPNGBDBM62681(5-amino-1-(2,3-dihydro-1,4-benzodioxin-6-yl)-N-[2-...)
Affinity DataIC50:  630nM. Assay description: NIH Molecular Libraries Screening Centers Network [MLSCN] Emory Chemical Biology Discovery Center in MLSCN Assay provider: Dr. Randal Kaufman, Univer...
Ligand InfoPC cidPC sid
In DepthDetails PCBioAssay
TargetNuclear receptor coactivator 3(Homo sapiens (Human))
The Scripps Research Institute Molecular Screening Center
Curated by PubChem BioAssay
LigandPNGBDBM62681(5-amino-1-(2,3-dihydro-1,4-benzodioxin-6-yl)-N-[2-...)
Affinity DataIC50: >3.59E+4nM. Assay description: Source (MLPCN Center Name): The Scripps Research Institute Molecular Screening Center (SRIMSC) Affiliation: The Scripps Research Institute, TSRI Assa...
Ligand InfoPC cidPC sid
In DepthDetails PCBioAssay
TargetTegument protein VP16(Human herpesvirus 1 (strain 17) (HHV-1) (Human her...)
The Scripps Research Institute Molecular Screening Center
Curated by PubChem BioAssay
LigandPNGBDBM62681(5-amino-1-(2,3-dihydro-1,4-benzodioxin-6-yl)-N-[2-...)
Affinity DataIC50:  2.31E+4nM. Assay description: Source (MLPCN Center Name): The Scripps Research Institute Molecular Screening Center (SRIMSC) Affiliation: The Scripps Research Institute, TSRI Assa...
Ligand InfoPC cidPC sid
In DepthDetails PCBioAssay
TargetNuclear receptor coactivator 1(Homo sapiens (Human))
The Scripps Research Institute Molecular Screening Center
Curated by PubChem BioAssay
LigandPNGBDBM62681(5-amino-1-(2,3-dihydro-1,4-benzodioxin-6-yl)-N-[2-...)
Affinity DataIC50: >3.59E+4nM. Assay description: Source (MLPCN Center Name): The Scripps Research Institute Molecular Screening Center (SRIMSC) Affiliation: The Scripps Research Institute, TSRI Assa...
Ligand InfoPC cidPC sid
In DepthDetails PCBioAssay
TargetDNA damage-inducible transcript 3 protein(Mus musculus)
Emory University
Curated by PubChem BioAssay
LigandPNGBDBM62681(5-amino-1-(2,3-dihydro-1,4-benzodioxin-6-yl)-N-[2-...)
Affinity DataIC50:  690nM. Assay description: NIH Molecular Libraries Screening Centers Network [MLSCN] Emory Chemical Biology Discovery Center in MLSCN Assay provider: Dr. Randal Kaufman, Univer...
Ligand InfoPC cidPC sid
In DepthDetails PCBioAssay