BDBM62778 4-(3-oxo-5-phenyl-1H-pyrazol-2-yl)benzoic acid ethyl ester::4-(5-keto-3-phenyl-3-pyrazolin-1-yl)benzoic acid ethyl ester::MLS000088238::SMR000072482::cid_889901::ethyl 4-(3-oxidanylidene-5-phenyl-1H-pyrazol-2-yl)benzoate::ethyl 4-(3-oxo-5-phenyl-1H-pyrazol-2-yl)benzoate::ethyl 4-(5-oxo-3-phenyl-2,5-dihydro-1H-pyrazol-1-yl)benzoate
SMILES CCOC(=O)c1ccc(cc1)-n1[nH]c(cc1=O)-c1ccccc1
InChI Key InChIKey=NCYMTOGLPPVPKI-UHFFFAOYSA-N
Data  3 EC50
  Tab Delimited (TSV)   2D SDfile   Computed 3D by Vconf -m prep SDfile
Find this compound or compounds like it in BindingDB:
Activity Spreadsheet -- Enzyme Inhibition Constant Data from BindingDB
Found 3 hits for monomerid = 62778
TargetHeat shock factor protein 1(Mus musculus)
Broad Institute
Curated by PubChem BioAssay
LigandPNGBDBM62778(4-(3-oxo-5-phenyl-1H-pyrazol-2-yl)benzoic acid eth...)
Affinity DataEC50: >1.95E+5nM. Assay description: Keywords: Heat Shock Factor-1 (HSF-1), Stress Response, MG132, NIH3T3, Luminescence Assay Overview: Modified NIH3T3, transformed to express firefly...
In DepthDetails PCBioAssay
TargetProtein RecA(Mycobacterium tuberculosis H37Rv)
Broad Institute
Curated by PubChem BioAssay
LigandPNGBDBM62778(4-(3-oxo-5-phenyl-1H-pyrazol-2-yl)benzoic acid eth...)
Affinity DataEC50:  2.25E+3nM. Assay description: Keywords: GFP-RecA intein, protein splicing, refolding, reducing reagent, GFP fluorescence Assay Overview: M. tuberculosis harbors three inteins, whi...
In DepthDetails PCBioAssay
TargetProtein RecA(Mycobacterium tuberculosis H37Rv)
Broad Institute
Curated by PubChem BioAssay
LigandPNGBDBM62778(4-(3-oxo-5-phenyl-1H-pyrazol-2-yl)benzoic acid eth...)
Affinity DataEC50:  3.34E+3nM. Assay description: Keywords: GFP, refolding, reducing reagent, GFP fluorescence Assay Overview: M. tuberculosis harbors three inteins, which interrupt the DnaB, RecA, a...
In DepthDetails PCBioAssay