BDBM63361 3-[2-(3-methylphenoxy)ethanoylamino]-N-(2-methylpropyl)benzamide::3-[[2-(3-methylphenoxy)-1-oxoethyl]amino]-N-(2-methylpropyl)benzamide::3-[[2-(3-methylphenoxy)acetyl]amino]-N-(2-methylpropyl)benzamide::MLS000686546::N-isobutyl-3-[[2-(3-methylphenoxy)acetyl]amino]benzamide::N-isobutyl-3-{[(3-methylphenoxy)acetyl]amino}benzamide::SMR000268196::cid_879411
SMILES CC(C)CNC(=O)c1cccc(NC(=O)COc2cccc(C)c2)c1
InChI Key InChIKey=SNUNEKQWCRLBEP-UHFFFAOYSA-N
Data  1 EC50
  Tab Delimited (TSV)   2D SDfile   Computed 3D by Vconf -m prep SDfile
Find this compound or compounds like it in BindingDB:
Activity Spreadsheet -- Enzyme Inhibition Constant Data from BindingDB
Found 1 hit for monomerid = 63361
TargetHeat shock factor protein 1(Mus musculus)
Broad Institute
Curated by PubChem BioAssay
LigandPNGBDBM63361(3-[2-(3-methylphenoxy)ethanoylamino]-N-(2-methylpr...)
Affinity DataEC50: >1.95E+5nM. Assay description: Keywords: Heat Shock Factor-1 (HSF-1), Stress Response, MG132, NIH3T3, Luminescence Assay Overview: Modified NIH3T3, transformed to express firefly...
In DepthDetails PCBioAssay