BDBM63383 3-[5-[(methylcarbamothioylhydrazinylidene)methyl]furan-2-yl]benzoic acid::3-[5-[(methylthiocarbamoylhydrazono)methyl]-2-furyl]benzoic acid::3-[5-[[[methylamino(sulfanylidene)methyl]hydrazinylidene]methyl]-2-furanyl]benzoic acid::MLS000587657::SMR000211658::cid_929472
SMILES CNC(=S)NN=Cc1ccc(o1)-c1cccc(c1)C(O)=O
InChI Key InChIKey=WNCHYIAZCYPXBU-UHFFFAOYSA-N
Data  1 EC50
  Tab Delimited (TSV)   2D SDfile   Computed 3D by Vconf -m prep SDfile
Find this compound or compounds like it in BindingDB:
Activity Spreadsheet -- Enzyme Inhibition Constant Data from BindingDB
Found 1 hit for monomerid = 63383
TargetHeat shock factor protein 1(Mus musculus)
Broad Institute
Curated by PubChem BioAssay
LigandPNGBDBM63383(3-[5-[(methylcarbamothioylhydrazinylidene)methyl]f...)
Affinity DataEC50: >1.95E+5nM. Assay description: Keywords: Heat Shock Factor-1 (HSF-1), Stress Response, MG132, NIH3T3, Luminescence Assay Overview: Modified NIH3T3, transformed to express firefly...
In DepthDetails PCBioAssay