BDBM63384 1-(2-cyanoethyl)-N-(4-nitrophenyl)-3-phenyl-4-pyrazolecarboxamide::1-(2-cyanoethyl)-N-(4-nitrophenyl)-3-phenyl-pyrazole-4-carboxamide::1-(2-cyanoethyl)-N-(4-nitrophenyl)-3-phenylpyrazole-4-carboxamide::MLS000334064::SMR000248822::cid_2967453
SMILES [O-][N+](=O)c1ccc(NC(=O)c2cn(CCC#N)nc2-c2ccccc2)cc1
InChI Key InChIKey=JAXXNGNICSFUCZ-UHFFFAOYSA-N
Data  1 EC50
  Tab Delimited (TSV)   2D SDfile   Computed 3D by Vconf -m prep SDfile
Find this compound or compounds like it in BindingDB:
Activity Spreadsheet -- Enzyme Inhibition Constant Data from BindingDB
Found 1 hit for monomerid = 63384
TargetHeat shock factor protein 1(Mus musculus)
Broad Institute
Curated by PubChem BioAssay
LigandPNGBDBM63384(1-(2-cyanoethyl)-N-(4-nitrophenyl)-3-phenyl-4-pyra...)
Affinity DataEC50: >1.95E+5nM. Assay description: Keywords: Heat Shock Factor-1 (HSF-1), Stress Response, MG132, NIH3T3, Luminescence Assay Overview: Modified NIH3T3, transformed to express firefly...
In DepthDetails PCBioAssay