BDBM63524 4-chloranyl-1-methyl-3-nitro-quinolin-2-one::4-chloro-1-methyl-3-nitro-2-quinolinone::4-chloro-1-methyl-3-nitro-carbostyril::4-chloro-1-methyl-3-nitroquinolin-2-one::MLS000687758::SMR000283639::cid_701939
SMILES Cn1c2ccccc2c(Cl)c([N+]([O-])=O)c1=O
InChI Key InChIKey=KPDOVJBEKCRATD-UHFFFAOYSA-N
Data  5 IC50  1 EC50
  Tab Delimited (TSV)   2D SDfile   Computed 3D by Vconf -m prep SDfile
Find this compound or compounds like it in BindingDB:
Activity Spreadsheet -- Enzyme Inhibition Constant Data from BindingDB
Found 6 hits for monomerid = 63524
TargetHeat shock factor protein 1(Mus musculus)
Broad Institute
Curated by PubChem BioAssay
LigandPNGBDBM63524(4-chloranyl-1-methyl-3-nitro-quinolin-2-one | 4-ch...)
Affinity DataEC50:  4.30E+3nM. Assay description: Keywords: Heat Shock Factor-1 (HSF-1), Stress Response, MG132, NIH3T3, Luminescence Assay Overview: Modified NIH3T3, transformed to express firefly...
In DepthDetails PCBioAssay
TargetDNA damage-inducible transcript 3 protein(Mus musculus)
Emory University
Curated by PubChem BioAssay
LigandPNGBDBM63524(4-chloranyl-1-methyl-3-nitro-quinolin-2-one | 4-ch...)
Affinity DataIC50:  3.23E+3nM. Assay description: NIH Molecular Libraries Screening Centers Network [MLSCN] Emory Chemical Biology Discovery Center in MLSCN Assay provider: Dr. Randal Kaufman, Univer...
In DepthDetails PCBioAssay
TargetBeta-lactamase(Pseudomonas aeruginosa)
The Scripps Research Institute Molecular Screening Center
Curated by PubChem BioAssay
LigandPNGBDBM63524(4-chloranyl-1-methyl-3-nitro-quinolin-2-one | 4-ch...)
Affinity DataIC50:  1.78E+4nM. Assay description: Source (MLPCN Center Name): The Scripps Research Institute Molecular Screening Center (SRIMSC) Affiliation: The Scripps Research Institute, TSRI Assa...
In DepthDetails PCBioAssay
TargetX-box-binding protein 1(Homo sapiens (Human))
Emory University
Curated by PubChem BioAssay
LigandPNGBDBM63524(4-chloranyl-1-methyl-3-nitro-quinolin-2-one | 4-ch...)
Affinity DataIC50:  5.68E+3nM. Assay description: NIH Molecular Libraries Screening Centers Network [MLSCN] Emory Chemical Biology Discovery Center in MLSCN Assay provider: Dr. Randal Kaufman, Univer...
In DepthDetails PCBioAssay
TargetToll-like receptor 9(Homo sapiens (Human))
The Scripps Research Institute Molecular Screening Center
Curated by PubChem BioAssay
LigandPNGBDBM63524(4-chloranyl-1-methyl-3-nitro-quinolin-2-one | 4-ch...)
Affinity DataIC50:  3.66E+3nM. Assay description: Source (MLPCN Center Name): The Scripps Research Institute Molecular Screening Center (SRIMSC) Affiliation: The Scripps Research Institute, TSRI Assa...
In DepthDetails PCBioAssay
TargetDNA damage-inducible transcript 3 protein(Mus musculus)
Emory University
Curated by PubChem BioAssay
LigandPNGBDBM63524(4-chloranyl-1-methyl-3-nitro-quinolin-2-one | 4-ch...)
Affinity DataIC50:  3.23E+3nM. Assay description: NIH Molecular Libraries Screening Centers Network [MLSCN] Emory Chemical Biology Discovery Center in MLSCN Assay provider: Dr. Randal Kaufman, Univer...
In DepthDetails PCBioAssay