BDBM64032 MLS001210777::N-[(5-Chloro-8-hydroxy-quinolin-7-yl)-p-tolyl-methyl]-acetamide::N-[(5-chloranyl-8-oxidanyl-quinolin-7-yl)-(4-methylphenyl)methyl]ethanamide::N-[(5-chloro-8-hydroxy-7-quinolinyl)-(4-methylphenyl)methyl]acetamide::N-[(5-chloro-8-hydroxy-7-quinolyl)-(p-tolyl)methyl]acetamide::N-[(5-chloro-8-hydroxyquinolin-7-yl)-(4-methylphenyl)methyl]acetamide::SMR000517145::cid_2920402
SMILES CC(=O)NC(c1ccc(C)cc1)c1cc(Cl)c2cccnc2c1O
InChI Key InChIKey=NTUQQFGFRQITLD-UHFFFAOYSA-N
Data  1 IC50  1 EC50
  Tab Delimited (TSV)   2D SDfile   Computed 3D by Vconf -m prep SDfile
Find this compound or compounds like it in BindingDB:
Activity Spreadsheet -- Enzyme Inhibition Constant Data from BindingDB
Found 2 hits for monomerid = 64032
TargetRecBCD enzyme subunit RecD(Escherichia coli str. K-12 substr. MG1655)
The Scripps Research Institute Molecular Screening Center
Curated by PubChem BioAssay
LigandPNGBDBM64032(MLS001210777 | N-[(5-Chloro-8-hydroxy-quinolin-7-y...)
Affinity DataIC50: >1.19E+5nM
In DepthDetails PCBioAssay
TargetHeat shock factor protein 1(Mus musculus)
Broad Institute
Curated by PubChem BioAssay
LigandPNGBDBM64032(MLS001210777 | N-[(5-Chloro-8-hydroxy-quinolin-7-y...)
Affinity DataEC50:  911nM. Assay description: Keywords: Heat Shock Factor-1 (HSF-1), Stress Response, MG132, NIH3T3, Luminescence Assay Overview: Modified NIH3T3, transformed to express firefly...
In DepthDetails PCBioAssay