BDBM64106 MLS001165977::N-[4-(4-methyl-1-piperazinyl)phenyl]-2,3-dihydroindole-1-carboxamide::N-[4-(4-methylpiperazin-1-yl)phenyl]-2,3-dihydroindole-1-carboxamide::N-[4-(4-methylpiperazino)phenyl]-1-indolinecarboxamide::N-[4-(4-methylpiperazino)phenyl]indoline-1-carboxamide::SMR000550240::cid_3789016
SMILES CN1CCN(CC1)c1ccc(NC(=O)N2CCc3ccccc23)cc1
InChI Key InChIKey=ZYNVTZVPJIPRQT-UHFFFAOYSA-N
Data  3 IC50  1 EC50
  Tab Delimited (TSV)   2D SDfile   Computed 3D by Vconf -m prep SDfile
Find this compound or compounds like it in BindingDB:
Activity Spreadsheet -- Enzyme Inhibition Constant Data from BindingDB
Found 4 hits for monomerid = 64106
TargetHeat shock factor protein 1(Mus musculus)
Broad Institute
Curated by PubChem BioAssay
LigandPNGBDBM64106(MLS001165977 | N-[4-(4-methyl-1-piperazinyl)phenyl...)
Affinity DataEC50: <160nM. Assay description: Keywords: Heat Shock Factor-1 (HSF-1), Stress Response, MG132, NIH3T3, Luminescence Assay Overview: Modified NIH3T3, transformed to express firefly...
In DepthDetails PCBioAssay
TargetNuclear receptor coactivator 1(Homo sapiens (Human))
The Scripps Research Institute Molecular Screening Center
Curated by PubChem BioAssay
LigandPNGBDBM64106(MLS001165977 | N-[4-(4-methyl-1-piperazinyl)phenyl...)
Affinity DataIC50: >3.59E+4nM. Assay description: Source (MLPCN Center Name): The Scripps Research Institute Molecular Screening Center (SRIMSC) Affiliation: The Scripps Research Institute, TSRI Assa...
In DepthDetails PCBioAssay
TargetTegument protein VP16(Human herpesvirus 1 (strain 17) (HHV-1) (Human her...)
The Scripps Research Institute Molecular Screening Center
Curated by PubChem BioAssay
LigandPNGBDBM64106(MLS001165977 | N-[4-(4-methyl-1-piperazinyl)phenyl...)
Affinity DataIC50:  1.81E+4nM. Assay description: Source (MLPCN Center Name): The Scripps Research Institute Molecular Screening Center (SRIMSC) Affiliation: The Scripps Research Institute, TSRI Assa...
In DepthDetails PCBioAssay
TargetNuclear receptor coactivator 3(Homo sapiens (Human))
The Scripps Research Institute Molecular Screening Center
Curated by PubChem BioAssay
LigandPNGBDBM64106(MLS001165977 | N-[4-(4-methyl-1-piperazinyl)phenyl...)
Affinity DataIC50: >3.59E+4nM. Assay description: Source (MLPCN Center Name): The Scripps Research Institute Molecular Screening Center (SRIMSC) Affiliation: The Scripps Research Institute, TSRI Assa...
In DepthDetails PCBioAssay