BDBM64866 5-(3,4-dichlorophenyl)-1-(4-fluorophenyl)-1H-pyrazole-3-carboxylic acid::5-(3,4-dichlorophenyl)-1-(4-fluorophenyl)-3-pyrazolecarboxylic acid::5-(3,4-dichlorophenyl)-1-(4-fluorophenyl)pyrazole-3-carboxylic acid::MLS001166253::SMR000549977::cid_1477266
SMILES OC(=O)c1cc(-c2ccc(Cl)c(Cl)c2)n(n1)-c1ccc(F)cc1
InChI Key InChIKey=GZXXYOGQURAPNS-UHFFFAOYSA-N
Data  2 IC50
  Tab Delimited (TSV)   2D SDfile   Computed 3D by Vconf -m prep SDfile
Find this compound or compounds like it in BindingDB:
Activity Spreadsheet -- Enzyme Inhibition Constant Data from BindingDB
Found 2 hits for monomerid = 64866
TargetTrans-activator protein BZLF1(Human herpesvirus 4)
The Scripps Research Institute Molecular Screening Center
Curated by PubChem BioAssay
LigandPNGBDBM64866(5-(3,4-dichlorophenyl)-1-(4-fluorophenyl)-1H-pyraz...)
Affinity DataIC50: >6.70E+4nM. Assay description: Source (MLPCN Center Name): The Scripps Research Institute Molecular Screening Center (SRIMSC) Center Affiliation: The Scripps Research Institute (TS...
In DepthDetails PCBioAssay
TargetMu-type opioid receptor(Homo sapiens (Human))
The Scripps Research Institute Molecular Screening Center
Curated by PubChem BioAssay
LigandPNGBDBM64866(5-(3,4-dichlorophenyl)-1-(4-fluorophenyl)-1H-pyraz...)
Affinity DataIC50:  8.13E+3nM. Assay description: Source (MLPCN Center Name): The Scripps Research Institute Molecular Screening Center (SRIMSC) Center Affiliation: The Scripps Research Institute (TS...
In DepthDetails PCBioAssay