BDBM64881 Furan-2-carboxylic acid [2-(2,3,4-trimethoxy-benzylamino)-ethyl]-amide::MLS000067942::N-[2-[(2,3,4-trimethoxybenzyl)amino]ethyl]-2-furamide::N-[2-[(2,3,4-trimethoxyphenyl)methylamino]ethyl]-2-furancarboxamide::N-[2-[(2,3,4-trimethoxyphenyl)methylamino]ethyl]furan-2-carboxamide::SMR000014689::cid_649433
SMILES COc1ccc(CNCCNC(=O)c2ccco2)c(OC)c1OC
InChI Key InChIKey=BQXJHGBYENYMJN-UHFFFAOYSA-N
Data  1 EC50
  Tab Delimited (TSV)   2D SDfile   Computed 3D by Vconf -m prep SDfile
Find this compound or compounds like it in BindingDB:
Activity Spreadsheet -- Enzyme Inhibition Constant Data from BindingDB
Found 1 hit for monomerid = 64881
TargetATP-dependent molecular chaperone HSP82(Candida albicans)
Broad Institute
Curated by PubChem BioAssay
LigandPNGBDBM64881(Furan-2-carboxylic acid [2-(2,3,4-trimethoxy-benzy...)
Affinity DataEC50: >1.60E+5nM. Assay description: Broad Institute: Reversing Antifungal Drug Resistance Project ID: 2037 Keywords: Candida albicans, drug resistance, Fluconazole, Hsp90, Calcineurin, ...
In DepthDetails PCBioAssay