BDBM64885 4-tert-butyl-N-[4-(4-ethanoylpiperazin-1-yl)phenyl]benzamide::MLS000035065::N-[4-(4-Acetyl-piperazin-1-yl)-phenyl]-4-tert-butyl-benzamide::N-[4-(4-acetyl-1-piperazinyl)phenyl]-4-tert-butylbenzamide::N-[4-(4-acetylpiperazin-1-yl)phenyl]-4-tert-butylbenzamide::N-[4-(4-acetylpiperazino)phenyl]-4-tert-butyl-benzamide::SMR000011382::cid_651871
SMILES CC(=O)N1CCN(CC1)c1ccc(NC(=O)c2ccc(cc2)C(C)(C)C)cc1
InChI Key InChIKey=QMOUBAJUCQQEEL-UHFFFAOYSA-N
Data  1 EC50
  Tab Delimited (TSV)   2D SDfile   Computed 3D by Vconf -m prep SDfile
Find this compound or compounds like it in BindingDB:
Activity Spreadsheet -- Enzyme Inhibition Constant Data from BindingDB
Found 1 hit for monomerid = 64885
TargetATP-dependent molecular chaperone HSP82(Candida albicans)
Broad Institute
Curated by PubChem BioAssay
LigandPNGBDBM64885(4-tert-butyl-N-[4-(4-ethanoylpiperazin-1-yl)phenyl...)
Affinity DataEC50:  1.19E+4nM. Assay description: Broad Institute: Reversing Antifungal Drug Resistance Project ID: 2037 Keywords: Candida albicans, drug resistance, Fluconazole, Hsp90, Calcineurin, ...
In DepthDetails PCBioAssay