BDBM64889 4-Amino-isothiazole-3,5-dicarboxylic acid 3-amide 5-{(4-fluoro-benzyl)-[furan-2-yl-(3-methyl-butylcarbamoyl)-methyl]-amide}::4-amino-5-N-[(4-fluorophenyl)methyl]-5-N-[1-(furan-2-yl)-2-(3-methylbutylamino)-2-oxoethyl]-1,2-thiazole-3,5-dicarboxamide::4-amino-N'-(4-fluorobenzyl)-N'-[1-(2-furyl)-2-(isoamylamino)-2-keto-ethyl]isothiazole-3,5-dicarboxamide::4-amino-N5-[(4-fluorophenyl)methyl]-N5-[1-(2-furanyl)-2-(3-methylbutylamino)-2-oxoethyl]isothiazole-3,5-dicarboxamide::4-azanyl-N5-[(4-fluorophenyl)methyl]-N5-[1-(furan-2-yl)-2-(3-methylbutylamino)-2-oxidanylidene-ethyl]-1,2-thiazole-3,5-dicarboxamide::MLS000070345::SMR000002695::cid_652777
SMILES CC(C)CCNC(=O)C(N(Cc1ccc(F)cc1)C(=O)c1snc(C(N)=O)c1N)c1ccco1
InChI Key InChIKey=VZYADZNYZDPHDV-UHFFFAOYSA-N
Data  2 EC50
  Tab Delimited (TSV)   2D SDfile   Computed 3D by Vconf -m prep SDfile
Find this compound or compounds like it in BindingDB:
Activity Spreadsheet -- Enzyme Inhibition Constant Data from BindingDB
Found 2 hits for monomerid = 64889
TargetImportin subunit alpha-1(Homo sapiens (Human))
Broad Institute
Curated by PubChem BioAssay
LigandPNGBDBM64889(4-Amino-isothiazole-3,5-dicarboxylic acid 3-amide ...)
Affinity DataEC50: >5.00E+5nM. Assay description: Keywords: Counterscreen, FRET assay, HTS, YIC probe, Dose response, Assay Overview: This is a fluorescence resonance energy transfer (FRET)-based b...
In DepthDetails PCBioAssay
TargetATP-dependent molecular chaperone HSP82(Candida albicans)
Broad Institute
Curated by PubChem BioAssay
LigandPNGBDBM64889(4-Amino-isothiazole-3,5-dicarboxylic acid 3-amide ...)
Affinity DataEC50:  1.58E+4nM. Assay description: Broad Institute: Reversing Antifungal Drug Resistance Project ID: 2037 Keywords: Candida albicans, drug resistance, Fluconazole, Hsp90, Calcineurin, ...
In DepthDetails PCBioAssay