BDBM64917 2-[(4-phenyl-1,3-thiazol-2-yl)sulfanyl]-N-(1,3-thiazol-2-yl)acetamide::2-[(4-phenyl-1,3-thiazol-2-yl)sulfanyl]-N-(1,3-thiazol-2-yl)ethanamide::2-[(4-phenyl-2-thiazolyl)thio]-N-(2-thiazolyl)acetamide::2-[(4-phenylthiazol-2-yl)thio]-N-thiazol-2-yl-acetamide::MLS000098603::SMR000068568::cid_2564305
SMILES O=C(CSc1nc(cs1)-c1ccccc1)Nc1nccs1
InChI Key InChIKey=SJKDWTKQDUPHTR-UHFFFAOYSA-N
Data  1 EC50
  Tab Delimited (TSV)   2D SDfile   Computed 3D by Vconf -m prep SDfile
Find this compound or compounds like it in BindingDB:
Activity Spreadsheet -- Enzyme Inhibition Constant Data from BindingDB
Found 1 hit for monomerid = 64917
TargetATP-dependent molecular chaperone HSP82(Candida albicans)
Broad Institute
Curated by PubChem BioAssay
LigandPNGBDBM64917(2-[(4-phenyl-1,3-thiazol-2-yl)sulfanyl]-N-(1,3-thi...)
Affinity DataEC50: >1.60E+5nM. Assay description: Broad Institute: Reversing Antifungal Drug Resistance Project ID: 2037 Keywords: Candida albicans, drug resistance, Fluconazole, Hsp90, Calcineurin, ...
In DepthDetails PCBioAssay