BDBM64941 2-[3-(2-amino-2-keto-ethyl)-1-adamantyl]acetamide::2-[3-(2-amino-2-oxoethyl)-1-adamantyl]acetamide::2-[3-(2-azanyl-2-oxidanylidene-ethyl)-1-adamantyl]ethanamide::MLS000087661::SMR000023882::cid_541702
SMILES [H]C12CC3([H])CC(CC(N)=O)(C1)CC(CC(N)=O)(C2)C3
InChI Key InChIKey=BQXJYESUHDZQOE-UHFFFAOYSA-N
Data  1 EC50
  Tab Delimited (TSV)   2D SDfile   Computed 3D by Vconf -m prep SDfile
Find this compound or compounds like it in BindingDB:
Activity Spreadsheet -- Enzyme Inhibition Constant Data from BindingDB
Found 1 hit for monomerid = 64941
TargetATP-dependent molecular chaperone HSP82(Candida albicans)
Broad Institute
Curated by PubChem BioAssay
LigandPNGBDBM64941(2-[3-(2-amino-2-keto-ethyl)-1-adamantyl]acetamide ...)
Affinity DataEC50: >1.60E+5nM. Assay description: Broad Institute: Reversing Antifungal Drug Resistance Project ID: 2037 Keywords: Candida albicans, drug resistance, Fluconazole, Hsp90, Calcineurin, ...
In DepthDetails PCBioAssay